program: Orca
programVersion: 5.0.2
elementType: F F F O O O O O N C C C C C C C C C C C C C C C C C C C H H H H H H H H H H H H H H H H H H H H
charge: 0
multiplicity: 1
keywords: wb97x-d3
keywords: def2-TZVPP
keywords: def2/J RIJCOSX
keywords: DEFGRID2
keywords: scfconv7
keywords: smallprint printgap noloewdin
keywords: NOSOSCF
formula: C19H20F3NO5
InChI: InChI=1/C19H20F3NO5/c1-27-6-7-28-9-13-12(4-5-14(23-13)19(20,21)22)18(26)15-16(24)10-2-3-11(8-10)17(15)25/h4-5,10-11,24H,2-3,6-9H2,1H3
48 atoms
F  -5.376308 -0.817706 1.023808
F  -4.765206 -1.732512 -0.8210
F  -4.798887 -2.892626 0.990626
O  0.875087 -1.559351 -1.046496
O  3.37347 0.917767 2.0780
O  0.910385 0.928347 2.305172
O  -0.174747 2.204696 -0.215964
O  1.179241 3.835952 -2.174628
N  -2.825993 -0.014404 0.506515
C  3.249584 -1.62738 -1.11498
C  4.478487 -0.349744 0.416662
C  4.296079 -1.799464 -0.021044
C  3.814239 -0.447261 -1.937882
C  4.610129 0.404258 -0.93025
C  1.920154 -1.214284 -0.521309
C  3.226237 0.09232 1.091887
C  1.976645 -0.344578 0.656054
C  0.81127 0.124856 1.369043
C  -0.554374 -0.401025 1.079142
C  -1.595007 0.44065 0.675947
C  -0.841508 -1.730653 1.336393
C  -1.387031 1.913137 0.419038
C  -2.13757 -2.194628 1.182455
C  -3.087445 -1.286618 0.756535
C  -4.513971 -1.686868 0.493379
C  -0.14732 1.854665 -1.584795
C  1.102015 2.431778 -2.210475
C  0.285399 4.485551 -3.044598
H  3.092256 -2.517551 -1.724367
H  5.328665 -0.17915 1.077162
H  3.985073 -2.461973 0.788702
H  5.226985 -2.190598 -0.435829
H  4.470887 -0.840686 -2.71428
H  3.031638 0.117539 -2.445316
H  4.251655 1.432379 -0.866532
H  5.664945 0.453714 -1.200398
H  -0.063313 -2.407178 1.666099
H  -2.245568 2.284432 -0.153728
H  -1.384722 2.446692 1.373597
H  -2.374118 -3.229438 1.38341
H  -1.050635 2.219173 -2.092129
H  -0.129405 0.767488 -1.724495
H  1.981326 2.061747 -1.675903
H  1.166755 2.05589 -3.241293
H  0.364707 4.109811 -4.072271
H  -0.761065 4.396717 -2.732857
H  0.540742 5.545549 -3.050235
H  2.451127 1.154512 2.410911
elementType: F O N C H
totalener: -1466.66177223 hartree
nucrepener: 2853.10967152 hartree
electener: -4319.77144375 hartree
oneelecener: -7684.94711229 hartree
twoeener: 3365.17566855 hartree
cpcmener: -0.03923375 hartree
kineticenergy: 1460.84583544 hartree
xcener: -133.540798670130 hartree
chargesum: 0.0000000
charge: -0.173372 -0.176634 -0.177809 -0.460336 -0.302566 -0.440115 -0.362526 -0.386664 -0.344877 0.257185 0.232872 -0.269500 -0.244685 -0.236819 0.159276 0.199866 -0.256654 0.338961 0.027982 0.109696 -0.140894 0.031045 -0.114779 0.100704 0.494774 -0.008962 0.027329 -0.112258 0.074061 0.084696 0.096179 0.096596 0.105020 0.098622 0.102765 0.104241 0.159077 0.101182 0.118987 0.148523 0.109381 0.105385 0.072663 0.084271 0.091022 0.094292 0.116061 0.266735
qa: -0.1734 -0.1766 -0.1778 -0.4603 -0.3026 -0.4401 -0.3625 -0.3867 -0.3449 0.2572 0.2329 -0.2695 -0.2447 -0.2368 0.1593 0.1999 -0.2567 0.3390 0.0280 0.1097 -0.1409 0.0310 -0.1148 0.1007 0.4948 -0.0090 0.0273 -0.1123 0.0741 0.0847 0.0962 0.0966 0.1050 0.0986 0.1028 0.1042 0.1591 0.1012 0.1190 0.1485 0.1094 0.1054 0.0727 0.0843 0.0910 0.0943 0.1161 0.2667
va: 1.1299 1.1196 1.1246 2.0097 2.2629 2.0697 1.9314 1.9273 3.0977 3.6520 3.7062 4.0739 3.9319 3.9649 4.0080 3.9660 3.3217 3.8581 3.5456 3.8757 3.9824 3.8358 3.9456 3.8888 4.5184 3.8026 4.0104 3.9115 1.0262 1.0208 1.0143 1.0074 1.0053 1.0155 1.0055 1.0070 0.9956 1.0212 1.0010 1.0055 0.9966 1.0048 0.9928 0.9992 0.9913 0.9818 0.9919 1.0659
dispcorr: -0.027638739 hartree
energy: -1466.689410973082
dipole: 45.58346 -42.42058 3.16288 19.53813 -20.60797 -1.06984 -19.42340 18.81561 -0.60779
magnitude: 3.39378 au
magnitude: 8.62631 debye
