program: Orca
programVersion: 5.0.2
elementType: F F F O O O O O N C C C C C C C C C C C C C C C C C C C H H H H H H H H H H H H H H H H H H H H
charge: 0
multiplicity: 1
keywords: wb97x-d3
keywords: def2-TZVPP
keywords: def2/J RIJCOSX
keywords: DEFGRID2
keywords: scfconv7
keywords: smallprint printgap noloewdin
keywords: NOSOSCF
formula: C19H20F3NO5
InChI: InChI=1/C19H20F3NO5/c1-27-6-7-28-9-13-12(4-5-14(23-13)19(20,21)22)18(26)15-16(24)10-2-3-11(8-10)17(15)25/h4-5,10-11,24H,2-3,6-9H2,1H3
48 atoms
F  -4.526121 -1.866172 1.389543
F  -5.252861 -0.952569 -0.415858
F  -4.816031 -3.058853 -0.379544
O  0.845317 -1.369349 1.420953
O  3.461448 0.4847 -2.019293
O  1.121011 -0.156751 -2.540583
O  -0.045567 1.926877 -0.623673
O  -0.517066 4.253445 1.177908
N  -2.550764 -0.389582 0.080067
C  3.126471 -0.818138 1.832667
C  4.400356 0.163036 0.126992
C  3.891474 0.465656 1.531557
C  4.111597 -1.92016 1.373262
C  4.97564 -1.265803 0.277234
C  1.874172 -0.880639 0.985733
C  3.237048 0.097568 -0.801798
C  2.0018 -0.383069 -0.383942
C  0.922632 -0.40696 -1.34564
C  -0.461207 -0.816841 -0.961192
C  -1.320676 -0.009876 -0.20615
C  -0.94225 -2.021437 -1.439255
C  -0.900144 1.332609 0.31904
C  -2.234261 -2.420545 -1.125197
C  -2.987767 -1.563562 -0.351916
C  -4.401533 -1.86847 0.058667
C  0.904339 2.843894 -0.129404
C  0.358678 4.23709 0.078929
C  -1.147095 5.49561 1.357923
H  2.842288 -0.92945 2.879113
H  5.134325 0.873724 -0.253591
H  3.277795 1.366728 1.587778
H  4.730224 0.586427 2.219672
H  4.726802 -2.223076 2.220737
H  3.59647 -2.815747 1.023902
H  4.967013 -1.820003 -0.66158
H  6.017249 -1.188165 0.58994
H  -0.31288 -2.664308 -2.041272
H  -1.797443 1.930034 0.505631
H  -0.397569 1.19741 1.2868
H  -2.616335 -3.364756 -1.485313
H  1.69624 2.902812 -0.880296
H  1.360353 2.474469 0.798655
H  1.208104 4.917312 0.242514
H  -0.147651 4.575667 -0.83663
H  -1.801015 5.418776 2.226683
H  -0.427649 6.302896 1.541114
H  -1.757456 5.778771 0.491921
H  2.617574 0.320003 -2.544082
elementType: F O N C H
totalener: -1466.66194977 hartree
nucrepener: 2835.68027838 hartree
electener: -4302.34222815 hartree
oneelecener: -7650.64560854 hartree
twoeener: 3348.30338038 hartree
cpcmener: -0.03917436 hartree
kineticenergy: 1460.85937775 hartree
xcener: -133.542776537960 hartree
chargesum: -0.0000000
charge: -0.175494 -0.175977 -0.178184 -0.461117 -0.313724 -0.443809 -0.363771 -0.370857 -0.344711 0.237785 0.232049 -0.284408 -0.225567 -0.210677 0.183943 0.169928 -0.267181 0.386888 0.049084 0.126302 -0.121816 -0.050276 -0.135093 0.103925 0.496105 0.068317 0.022850 -0.118939 0.072427 0.084271 0.104025 0.099480 0.099382 0.095216 0.096788 0.099304 0.150659 0.096398 0.115215 0.149963 0.102652 0.069076 0.084060 0.079250 0.113393 0.092015 0.094396 0.266453
qa: -0.1755 -0.1760 -0.1782 -0.4611 -0.3137 -0.4438 -0.3638 -0.3709 -0.3447 0.2378 0.2320 -0.2844 -0.2256 -0.2107 0.1839 0.1699 -0.2672 0.3869 0.0491 0.1263 -0.1218 -0.0503 -0.1351 0.1039 0.4961 0.0683 0.0229 -0.1189 0.0724 0.0843 0.1040 0.0995 0.0994 0.0952 0.0968 0.0993 0.1507 0.0964 0.1152 0.1500 0.1027 0.0691 0.0841 0.0792 0.1134 0.0920 0.0944 0.2665
va: 1.1249 1.1236 1.1244 2.0286 2.2435 2.0599 1.9497 1.9291 3.1195 3.6649 3.7168 4.0683 3.9457 3.9437 4.0067 3.9699 3.3452 3.8109 3.5748 3.9279 4.0274 4.0250 3.9237 3.8771 4.5136 3.8544 3.9697 3.9136 1.0283 1.0211 1.0149 1.0089 1.0035 1.0109 1.0117 1.0049 1.0054 1.0280 0.9960 1.0052 0.9972 1.0257 1.0002 0.9993 0.9930 0.9888 0.9900 1.0654
dispcorr: -0.026845975 hartree
energy: -1466.688795749242
dipole: 45.14213 -41.08764 4.05449 28.01748 -27.04092 0.97656 7.99679 -7.92127 0.07553
magnitude: 4.17112 au
magnitude: 10.60214 debye
