program: Orca
programVersion: 5.0.2
elementType: F F F O O O O O N C C C C C C C C C C C C C C C C C C C H H H H H H H H H H H H H H H H H H H H
charge: 0
multiplicity: 1
keywords: wb97x-d3
keywords: def2-TZVPP
keywords: def2/J RIJCOSX
keywords: DEFGRID2
keywords: scfconv7
keywords: smallprint printgap noloewdin
keywords: NOSOSCF
formula: C19H20F3NO5
InChI: InChI=1/C19H20F3NO5/c1-27-6-7-28-9-13-12(4-5-14(23-13)19(20,21)22)18(26)15-16(24)10-2-3-11(8-10)17(15)25/h4-5,10-11,24H,2-3,6-9H2,1H3
48 atoms
F  -4.843165 -3.003165 -0.860549
F  -4.906608 -2.123601 1.103943
F  -5.48863 -0.96669 -0.611293
O  1.016037 -1.611115 1.120149
O  2.892774 1.559166 -1.802208
O  0.40782 1.411672 -1.639656
O  -0.087178 1.420344 1.526702
O  1.682416 3.524052 0.494165
N  -2.904175 -0.347441 0.421427
C  3.387928 -1.43917 0.928811
C  4.308544 0.19235 -0.487174
C  4.25284 -0.182719 0.990708
C  3.995401 -2.221626 -0.259959
C  4.645767 -1.1559 -1.163639
C  1.964763 -1.054853 0.595907
C  2.944456 0.615244 -0.913318
C  1.808719 -0.002919 -0.408643
C  0.520302 0.452331 -0.867052
C  -0.744468 -0.28253 -0.561711
C  -1.708887 0.206227 0.322602
C  -1.054221 -1.395435 -1.323106
C  -1.450684 1.394843 1.200994
C  -2.30865 -1.97566 -1.213644
C  -3.199524 -1.392413 -0.335024
C  -4.61264 -1.881047 -0.175725
C  0.33311 2.578834 2.217181
C  0.573633 3.771589 1.322613
C  1.865721 4.530465 -0.468802
H  3.387441 -2.019601 1.851428
H  5.027102 0.976247 -0.727349
H  3.837967 0.605422 1.622356
H  5.252989 -0.418224 1.359164
H  4.744597 -2.918507 0.116091
H  3.248513 -2.818523 -0.785107
H  4.30107 -1.202643 -2.196889
H  5.730091 -1.268748 -1.184812
H  -0.327512 -1.807089 -2.012207
H  -1.76701 2.303482 0.670349
H  -2.077141 1.317613 2.098015
H  -2.562846 -2.841311 -1.807877
H  1.259592 2.312987 2.732092
H  -0.394655 2.859534 2.987942
H  -0.321866 3.99939 0.726327
H  0.749221 4.647742 1.963641
H  1.022574 4.592408 -1.167597
H  1.996254 5.520049 -0.013436
H  2.766682 4.30145 -1.037086
H  1.92431 1.750053 -1.983727
elementType: F O N C H
totalener: -1466.66280312 hartree
nucrepener: 2872.76583879 hartree
electener: -4339.42864191 hartree
oneelecener: -7725.90352432 hartree
twoeener: 3386.47488241 hartree
cpcmener: -0.03953662 hartree
kineticenergy: 1460.86008725 hartree
xcener: -133.541883024724 hartree
chargesum: 0.0000000
charge: -0.178218 -0.174426 -0.177407 -0.459255 -0.314120 -0.448268 -0.337507 -0.369242 -0.349648 0.222656 0.224787 -0.263745 -0.224169 -0.213943 0.186712 0.195910 -0.278430 0.398427 0.060668 0.120167 -0.154110 -0.045891 -0.113141 0.094404 0.496618 0.001249 0.020541 -0.126797 0.070849 0.084000 0.095592 0.098210 0.097694 0.094021 0.095459 0.099038 0.151662 0.118930 0.099886 0.150104 0.095881 0.094748 0.082318 0.094306 0.099450 0.103858 0.106711 0.273462
qa: -0.1782 -0.1744 -0.1774 -0.4593 -0.3141 -0.4483 -0.3375 -0.3692 -0.3496 0.2227 0.2248 -0.2637 -0.2242 -0.2139 0.1867 0.1959 -0.2784 0.3984 0.0607 0.1202 -0.1541 -0.0459 -0.1131 0.0944 0.4966 0.0012 0.0205 -0.1268 0.0708 0.0840 0.0956 0.0982 0.0977 0.0940 0.0955 0.0990 0.1517 0.1189 0.0999 0.1501 0.0959 0.0947 0.0823 0.0943 0.0995 0.1039 0.1067 0.2735
va: 1.1241 1.1275 1.1202 2.0260 2.2514 2.0520 1.9738 1.9203 3.1129 3.6847 3.7362 4.0623 3.9436 3.9497 4.0232 3.9536 3.3759 3.7901 3.5913 3.9809 4.0234 4.0184 3.9058 3.8872 4.5122 3.9387 3.8793 3.8987 1.0269 1.0199 1.0198 1.0074 1.0043 1.0109 1.0120 1.0042 1.0004 0.9868 1.0133 1.0045 1.0035 1.0024 0.9943 1.0025 0.9905 0.9940 0.9968 1.0514
dispcorr: -0.027749399 hartree
energy: -1466.690552516186
dipole: 50.09572 -46.75339 3.34234 24.02178 -22.86880 1.15298 3.74800 -4.40940 -0.66141
magnitude: 3.59695 au
magnitude: 9.14271 debye
