program: Orca
programVersion: 5.0.2
elementType: F F F O O O O O N C C C C C C C C C C C C C C C C C C C H H H H H H H H H H H H H H H H H H H H
charge: 0
multiplicity: 1
keywords: wb97x-d3
keywords: def2-TZVPP
keywords: def2/J RIJCOSX
keywords: DEFGRID2
keywords: scfconv7
keywords: smallprint printgap noloewdin
keywords: NOSOSCF
formula: C19H20F3NO5
InChI: InChI=1/C19H20F3NO5/c1-27-6-7-28-9-13-12(4-5-14(23-13)19(20,21)22)18(26)15-16(24)10-2-3-11(8-10)17(15)25/h4-5,10-11,24H,2-3,6-9H2,1H3
48 atoms
F  -5.196828 -1.157186 0.90479
F  -5.208979 -2.344839 -0.887888
F  -4.241145 -3.080888 0.888124
O  0.865198 -1.885599 0.795128
O  3.081419 1.439837 -1.680329
O  0.64774 1.106773 -2.070302
O  -0.097801 1.894176 0.848088
O  0.791477 4.745791 0.468634
N  -2.620322 -0.531897 0.614344
C  3.193783 -1.508305 1.135024
C  4.272455 0.195958 -0.058829
C  3.944567 -0.202538 1.375502
C  4.084044 -2.234788 0.096321
C  4.836418 -1.116333 -0.650539
C  1.843892 -1.212169 0.520334
C  2.999528 0.527533 -0.761089
C  1.811184 -0.121861 -0.453875
C  0.607046 0.297477 -1.136961
C  -0.729586 -0.285405 -0.803378
C  -1.437265 0.00249 0.368217
C  -1.328316 -1.109404 -1.741993
C  -0.907204 0.913687 1.43428
C  -2.568839 -1.669152 -1.477225
C  -3.159851 -1.35478 -0.268841
C  -4.462688 -1.979017 0.157762
C  0.582271 2.684486 1.796355
C  1.472399 3.70112 1.118424
C  0.386321 4.475793 -0.852981
H  3.040248 -2.104864 2.034383
H  4.967832 1.030838 -0.150192
H  3.358855 0.54742 1.911169
H  4.861758 -0.379521 1.940256
H  4.782301 -2.888505 0.619395
H  3.502996 -2.869505 -0.573929
H  4.722098 -1.171243 -1.733322
H  5.905974 -1.155491 -0.441838
H  -0.823015 -1.338781 -2.671785
H  -1.752796 1.355806 1.974997
H  -0.341942 0.317309 2.165832
H  -3.0379 -2.324806 -2.197237
H  1.215357 2.053923 2.43747
H  -0.133768 3.194635 2.455478
H  2.079808 4.160091 1.903725
H  2.167907 3.195228 0.435007
H  1.200817 4.049716 -1.450298
H  -0.473962 3.80395 -0.913934
H  0.101225 5.425331 -1.307829
H  2.16876 1.530401 -2.093318
elementType: F O N C H
totalener: -1466.66034929 hartree
nucrepener: 2868.31445924 hartree
electener: -4334.97480853 hartree
oneelecener: -7715.15345954 hartree
twoeener: 3380.17865101 hartree
cpcmener: -0.03813410 hartree
kineticenergy: 1460.84693414 hartree
xcener: -133.539835320253 hartree
chargesum: -0.0000000
charge: -0.170324 -0.178093 -0.177682 -0.460261 -0.313610 -0.444774 -0.339940 -0.389341 -0.347573 0.230274 0.229897 -0.269754 -0.227585 -0.208363 0.178504 0.135810 -0.202378 0.358149 0.070155 0.114455 -0.123681 -0.036715 -0.157706 0.113975 0.497028 -0.002498 0.031238 -0.103755 0.072571 0.086481 0.097207 0.098603 0.099250 0.094665 0.096375 0.100130 0.151167 0.107943 0.113208 0.152363 0.085856 0.097869 0.104720 0.074229 0.080221 0.088994 0.119384 0.273312
qa: -0.1703 -0.1781 -0.1777 -0.4603 -0.3136 -0.4448 -0.3399 -0.3893 -0.3476 0.2303 0.2299 -0.2698 -0.2276 -0.2084 0.1785 0.1358 -0.2024 0.3581 0.0702 0.1145 -0.1237 -0.0367 -0.1577 0.1140 0.4970 -0.0025 0.0312 -0.1038 0.0726 0.0865 0.0972 0.0986 0.0993 0.0947 0.0964 0.1001 0.1512 0.1079 0.1132 0.1524 0.0859 0.0979 0.1047 0.0742 0.0802 0.0890 0.1194 0.2733
va: 1.1346 1.1233 1.1144 2.0293 2.2391 2.0528 1.9558 1.9206 3.0941 3.6694 3.7269 4.0699 3.9507 3.9464 4.0160 3.9779 3.3332 3.7963 3.5842 3.9529 4.0355 3.9998 3.9754 3.8755 4.5047 3.8391 3.9715 3.8981 1.0277 1.0200 1.0149 1.0086 1.0036 1.0105 1.0124 1.0044 1.0048 1.0152 0.9938 1.0054 1.0018 1.0042 0.9983 1.0125 0.9989 0.9990 0.9929 1.0553
dispcorr: -0.028569791 hartree
energy: -1466.688919081915
dipole: 49.11356 -45.27179 3.84177 21.58351 -21.76675 -0.18324 3.15516 -3.39893 -0.24378
magnitude: 3.85386 au
magnitude: 9.79572 debye
