program: Orca
programVersion: 5.0.2
elementType: F F F O O O O O N C C C C C C C C C C C C C C C C C C C H H H H H H H H H H H H H H H H H H H H
charge: 0
multiplicity: 1
keywords: wb97x-d3
keywords: def2-TZVPP
keywords: def2/J RIJCOSX
keywords: DEFGRID2
keywords: scfconv7
keywords: smallprint printgap noloewdin
keywords: NOSOSCF
formula: C19H20F3NO5
InChI: InChI=1/C19H20F3NO5/c1-27-6-7-28-9-13-12(4-5-14(23-13)19(20,21)22)18(26)15-16(24)10-2-3-11(8-10)17(15)25/h4-5,10-11,24H,2-3,6-9H2,1H3
48 atoms
F  -4.885492 -2.855761 0.904216
F  -5.503301 -0.82725 0.541214
F  -4.749118 -2.021279 -1.075739
O  0.776391 -1.905978 -0.645028
O  3.129221 1.397556 1.74083
O  0.661695 1.330785 1.96603
O  -0.726512 2.258166 -0.682518
O  2.074808 2.938834 -1.012425
N  -2.704482 -0.423931 -0.389361
C  3.152668 -1.800829 -0.793542
C  4.316085 -0.162839 0.418294
C  4.187253 -1.680118 0.320648
C  3.665733 -0.79389 -1.851918
C  4.474061 0.252904 -1.062013
C  1.800527 -1.347572 -0.291191
C  3.03312 0.378514 0.948839
C  1.8069 -0.186884 0.602447
C  0.612632 0.379705 1.176605
C  -0.733944 -0.216572 0.9167
C  -1.500641 0.088493 -0.212915
C  -1.270305 -1.05868 1.872868
C  -0.995499 1.013316 -1.280732
C  -2.530121 -1.605039 1.673337
C  -3.196748 -1.255341 0.516639
C  -4.586511 -1.7492 0.218646
C  -0.294842 3.25433 -1.581639
C  1.138032 3.081757 -2.052178
C  2.227381 4.080565 -0.203706
H  3.053127 -2.809007 -1.195618
H  5.141493 0.182377 1.041109
H  3.883749 -2.152865 1.256306
H  5.138353 -2.119414 0.014312
H  4.302988 -1.318461 -2.563822
H  2.853026 -0.349867 -2.42824
H  4.146761 1.274575 -1.248324
H  5.532874 0.204484 -1.317281
H  -0.706789 -1.311129 2.76219
H  -0.103147 0.577894 -1.749117
H  -1.759013 1.100686 -2.062572
H  -2.957062 -2.272865 2.408072
H  -0.416072 4.205544 -1.058188
H  -0.940746 3.299067 -2.469354
H  1.238277 2.191162 -2.67728
H  1.379639 3.944365 -2.690516
H  1.400361 4.220384 0.500022
H  3.143817 3.961107 0.373795
H  2.324087 4.995955 -0.800104
H  2.195607 1.646632 2.027268
elementType: F O N C H
totalener: -1466.66035438 hartree
nucrepener: 2886.60138281 hartree
electener: -4353.26173719 hartree
oneelecener: -7753.14460809 hartree
twoeener: 3399.88287090 hartree
cpcmener: -0.03904669 hartree
kineticenergy: 1460.84701197 hartree
xcener: -133.538410263134 hartree
chargesum: 0.0000000
charge: -0.178342 -0.177977 -0.172240 -0.459490 -0.304573 -0.441267 -0.352460 -0.371753 -0.329307 0.226091 0.252595 -0.267479 -0.219121 -0.236568 0.189059 0.145938 -0.241887 0.368412 0.036585 0.121461 -0.138684 -0.049112 -0.132060 0.112289 0.495402 -0.000035 0.012936 -0.133083 0.072935 0.084635 0.099458 0.097754 0.100532 0.093330 0.096208 0.101708 0.152248 0.115187 0.099762 0.152347 0.112060 0.089879 0.093758 0.095258 0.104152 0.103737 0.107887 0.271837
qa: -0.1783 -0.1780 -0.1722 -0.4595 -0.3046 -0.4413 -0.3525 -0.3718 -0.3293 0.2261 0.2526 -0.2675 -0.2191 -0.2366 0.1891 0.1459 -0.2419 0.3684 0.0366 0.1215 -0.1387 -0.0491 -0.1321 0.1123 0.4954 -0.0000 0.0129 -0.1331 0.0729 0.0846 0.0995 0.0978 0.1005 0.0933 0.0962 0.1017 0.1522 0.1152 0.0998 0.1523 0.1121 0.0899 0.0938 0.0953 0.1042 0.1037 0.1079 0.2718
va: 1.1235 1.1155 1.1311 2.0259 2.2559 2.0539 1.9376 1.9083 3.1269 3.6760 3.6973 4.0658 3.9366 3.9216 3.9844 3.9601 3.3849 3.7761 3.6071 3.9760 4.0310 3.9941 3.9454 3.8517 4.5106 3.8819 3.8669 3.9053 1.0267 1.0188 1.0135 1.0076 1.0056 1.0126 1.0418 1.0077 1.0024 0.9828 1.0246 1.0049 0.9910 1.0067 0.9951 1.0050 0.9832 0.9963 0.9950 1.0581
dispcorr: -0.028968604 hartree
energy: -1466.689322985870
dipole: 50.86265 -47.10773 3.75492 23.24859 -22.54299 0.70560 -11.60752 11.44941 -0.15811
magnitude: 3.82391 au
magnitude: 9.71961 debye
