program: Orca
programVersion: 5.0.2
elementType: F F F O O O O O N C C C C C C C C C C C C C C C C C C C H H H H H H H H H H H H H H H H H H H H
charge: 0
multiplicity: 1
keywords: wb97x-d3
keywords: def2-TZVPP
keywords: def2/J RIJCOSX
keywords: DEFGRID2
keywords: scfconv7
keywords: smallprint printgap noloewdin
keywords: NOSOSCF
formula: C19H20F3NO5
InChI: InChI=1/C19H20F3NO5/c1-27-6-7-28-9-13-12(4-5-14(23-13)19(20,21)22)18(26)15-16(24)10-2-3-11(8-10)17(15)25/h4-5,10-11,24H,2-3,6-9H2,1H3
48 atoms
F  -4.939138 -2.720074 -1.029029
F  -4.57444 -2.364807 1.064038
F  -5.348867 -0.788312 -0.173872
O  0.986183 -1.939134 0.875261
O  3.222841 1.350876 -1.628196
O  0.814506 0.976294 -2.068741
O  0.06027 1.802761 0.917357
O  1.226569 4.388767 1.103833
N  -2.580583 -0.535789 0.443613
C  3.307582 -1.538975 1.253523
C  4.397898 0.139854 0.030609
C  4.045925 -0.221299 1.469701
C  4.22615 -2.288836 0.257724
C  4.971081 -1.187234 -0.521466
C  1.969925 -1.273313 0.598842
C  3.137123 0.44998 -0.700042
C  1.951331 -0.215402 -0.409629
C  0.761911 0.173744 -1.126417
C  -0.584406 -0.408456 -0.837647
C  -1.356413 -0.067172 0.279911
C  -1.142454 -1.241897 -1.79049
C  -0.835086 0.828668 1.374366
C  -2.420943 -1.747875 -1.601503
C  -3.090307 -1.360985 -0.459133
C  -4.492228 -1.816716 -0.152682
C  -0.559282 2.909565 0.295577
C  0.497523 3.947226 -0.014715
C  0.479407 5.153276 2.018028
H  3.138786 -2.108131 2.167963
H  5.094236 0.972772 -0.070703
H  3.447584 0.54009 1.973557
H  4.954776 -0.377793 2.053829
H  4.928056 -2.906845 0.817989
H  3.667648 -2.961228 -0.394721
H  4.854942 -1.274745 -1.602175
H  6.041363 -1.213622 -0.314539
H  -0.582338 -1.516255 -2.675617
H  -1.688988 1.271855 1.900506
H  -0.297882 0.215569 2.103956
H  -2.859887 -2.407286 -2.336034
H  -1.343557 3.31971 0.94556
H  -1.049372 2.630033 -0.64661
H  1.22941 3.531395 -0.71177
H  0.003401 4.784638 -0.52743
H  -0.054276 5.977812 1.528685
H  -0.253833 4.56127 2.577455
H  1.178055 5.581822 2.737583
H  2.315003 1.418955 -2.061101
elementType: F O N C H
totalener: -1466.66275563 hartree
nucrepener: 2844.73483172 hartree
electener: -4311.39758734 hartree
oneelecener: -7668.70415010 hartree
twoeener: 3357.30656275 hartree
cpcmener: -0.03725213 hartree
kineticenergy: 1460.81939859 hartree
xcener: -133.535359267033 hartree
chargesum: -0.0000000
charge: -0.177928 -0.175020 -0.176424 -0.461435 -0.312094 -0.446567 -0.359801 -0.388894 -0.343629 0.214139 0.221171 -0.257944 -0.221747 -0.215882 0.179270 0.168857 -0.180562 0.291854 0.051920 0.088748 -0.117588 0.042857 -0.140699 0.103739 0.494628 -0.018443 0.018833 -0.115500 0.072386 0.084948 0.095999 0.096540 0.098838 0.094091 0.096772 0.099788 0.152202 0.107069 0.117330 0.150551 0.112033 0.103351 0.091140 0.087786 0.091686 0.094128 0.115866 0.271638
qa: -0.1779 -0.1750 -0.1764 -0.4614 -0.3121 -0.4466 -0.3598 -0.3889 -0.3436 0.2141 0.2212 -0.2579 -0.2217 -0.2159 0.1793 0.1689 -0.1806 0.2919 0.0519 0.0887 -0.1176 0.0429 -0.1407 0.1037 0.4946 -0.0184 0.0188 -0.1155 0.0724 0.0849 0.0960 0.0965 0.0988 0.0941 0.0968 0.0998 0.1522 0.1071 0.1173 0.1506 0.1120 0.1034 0.0911 0.0878 0.0917 0.0941 0.1159 0.2716
va: 1.1249 1.1268 1.1217 2.0261 2.2539 2.0484 1.9176 1.8992 3.1100 3.6980 3.7393 4.0639 3.9416 3.9467 4.0308 4.0009 3.3521 3.8558 3.5079 3.9025 4.0326 3.8395 3.9379 3.8856 4.5176 3.8151 3.9413 3.9195 1.0278 1.0207 1.0184 1.0075 1.0040 1.0116 1.0114 1.0043 1.0047 1.0198 0.9997 1.0051 0.9935 1.0050 1.0099 1.0018 0.9905 0.9808 0.9919 1.0584
dispcorr: -0.026891626 hartree
energy: -1466.689647253713
dipole: 44.59856 -42.07051 2.52805 23.96727 -23.38108 0.58620 7.20976 -7.85755 -0.64779
magnitude: 2.67475 au
magnitude: 6.79868 debye
