program: Orca
programVersion: 5.0.2
elementType: F F F O O O O O N C C C C C C C C C C C C C C C C C C C H H H H H H H H H H H H H H H H H H H H
charge: 0
multiplicity: 1
keywords: wb97x-d3
keywords: def2-TZVPP
keywords: def2/J RIJCOSX
keywords: DEFGRID2
keywords: scfconv7
keywords: smallprint printgap noloewdin
keywords: NOSOSCF
formula: C19H20F3NO5
InChI: InChI=1/C19H20F3NO5/c1-27-6-7-28-9-13-12(4-5-14(23-13)19(20,21)22)18(26)15-16(24)10-2-3-11(8-10)17(15)25/h4-5,10-11,24H,2-3,6-9H2,1H3
48 atoms
F  -4.972617 -1.802888 -1.023833
F  -4.700271 -3.203168 0.587593
F  -5.47348 -1.234929 0.988616
O  0.77265 -1.48364 -1.123993
O  3.037814 1.282863 1.923748
O  0.529771 1.384532 1.844239
O  -0.218536 1.753473 -1.114545
O  2.288962 3.09896 -0.649596
N  -2.946501 -0.259348 -0.188219
C  3.144189 -1.626169 -0.941351
C  4.261696 -0.242245 0.587285
C  4.048045 -1.721908 0.283006
C  3.843774 -0.547491 -1.803217
C  4.61456 0.336477 -0.803512
C  1.777998 -1.1173 -0.540558
C  2.963638 0.334301 1.040555
C  1.75652 -0.121185 0.530267
C  0.531337 0.440063 1.048188
C  -0.776164 -0.227795 0.769554
C  -1.768059 0.321603 -0.043723
C  -1.052306 -1.408993 1.437443
C  -1.574014 1.598778 -0.80531
C  -2.290421 -2.011381 1.287274
C  -3.198922 -1.384538 0.45764
C  -4.589387 -1.916307 0.247692
C  0.073679 2.999984 -1.703616
C  1.569616 3.144621 -1.857336
C  2.072765 4.19892 0.201344
H  3.021218 -2.56736 -1.477423
H  5.031367 -0.038625 1.332177
H  3.607535 -2.277196 1.113005
H  4.997596 -2.195533 0.027238
H  4.527587 -1.033466 -2.49933
H  3.134381 0.02127 -2.406301
H  4.368984 1.393992 -0.89065
H  5.691268 0.246423 -0.949211
H  -0.30448 -1.863867 2.074772
H  -2.197269 1.570227 -1.707649
H  -1.939512 2.438443 -0.194921
H  -2.518833 -2.932677 1.803413
H  -0.344649 3.819442 -1.103586
H  -0.38057 3.078096 -2.700707
H  1.954634 2.330765 -2.477163
H  1.760233 4.082416 -2.397252
H  2.185697 5.153371 -0.326667
H  1.085477 4.188902 0.674264
H  2.823151 4.160125 0.990725
H  2.105333 1.600075 2.107771
elementType: F O N C H
totalener: -1466.66318539 hartree
nucrepener: 2893.26782295 hartree
electener: -4359.93100834 hartree
oneelecener: -7766.90571026 hartree
twoeener: 3406.97470192 hartree
cpcmener: -0.03840836 hartree
kineticenergy: 1460.86856276 hartree
xcener: -133.544958980581 hartree
chargesum: 0.0000000
charge: -0.172248 -0.178596 -0.178163 -0.462679 -0.308076 -0.451978 -0.335335 -0.366697 -0.350298 0.235751 0.251005 -0.267559 -0.233449 -0.232000 0.191892 0.156034 -0.301995 0.411584 0.075883 0.122121 -0.157265 -0.024144 -0.116531 0.099516 0.495917 0.000886 0.007494 -0.133834 0.073223 0.084595 0.096210 0.096387 0.102153 0.096404 0.094346 0.101324 0.152379 0.097741 0.112421 0.150626 0.090409 0.097189 0.091013 0.097447 0.108040 0.099858 0.108702 0.272294
qa: -0.1722 -0.1786 -0.1782 -0.4627 -0.3081 -0.4520 -0.3353 -0.3667 -0.3503 0.2358 0.2510 -0.2676 -0.2334 -0.2320 0.1919 0.1560 -0.3020 0.4116 0.0759 0.1221 -0.1573 -0.0241 -0.1165 0.0995 0.4959 0.0009 0.0075 -0.1338 0.0732 0.0846 0.0962 0.0964 0.1022 0.0964 0.0943 0.1013 0.1524 0.0977 0.1124 0.1506 0.0904 0.0972 0.0910 0.0974 0.1080 0.0999 0.1087 0.2723
va: 1.1307 1.1238 1.1156 2.0224 2.2564 2.0447 1.9810 1.9139 3.0995 3.6660 3.6892 4.0705 3.9405 3.9204 4.0192 3.9550 3.3797 3.7902 3.5883 3.9851 4.0201 4.0074 3.9311 3.8855 4.5096 3.8763 3.9251 3.9090 1.0271 1.0184 1.0146 1.0072 1.0055 1.0133 1.0398 1.0077 0.9990 1.0085 0.9937 1.0046 0.9885 0.9995 0.9971 1.0039 0.9961 0.9792 0.9944 1.0510
dispcorr: -0.028998227 hartree
energy: -1466.692183616426
dipole: 50.43367 -47.18606 3.24761 25.40127 -24.45844 0.94283 -9.17358 9.47531 0.30174
magnitude: 3.39514 au
magnitude: 8.62975 debye
