program: Orca
programVersion: 5.0.2
elementType: F F F O O O O O N C C C C C C C C C C C C C C C C C C C H H H H H H H H H H H H H H H H H H H H
charge: 0
multiplicity: 1
keywords: wb97x-d3
keywords: def2-TZVPP
keywords: def2/J RIJCOSX
keywords: DEFGRID2
keywords: scfconv7
keywords: smallprint printgap noloewdin
keywords: NOSOSCF
formula: C19H20F3NO5
InChI: InChI=1/C19H20F3NO5/c1-27-6-7-28-9-13-12(4-5-14(23-13)19(20,21)22)18(26)15-16(24)10-2-3-11(8-10)17(15)25/h4-5,10-11,24H,2-3,6-9H2,1H3
48 atoms
F  -5.544938 -0.824151 0.786685
F  -4.982285 -1.967747 -0.943401
F  -4.944184 -2.877369 1.008235
O  0.895621 -1.807566 -0.857136
O  2.978139 1.450216 1.824098
O  0.473961 1.45899 1.644202
O  -0.052569 1.269381 -1.492722
O  1.953999 3.261659 -0.673978
N  -2.925256 -0.285642 -0.27712
C  3.273229 -1.694588 -0.766665
C  4.294797 -0.091317 0.60761
C  4.205563 -1.603598 0.436179
C  3.855193 -0.637562 -1.736583
C  4.551965 0.402225 -0.837602
C  1.876529 -1.273965 -0.370114
C  2.961808 0.420384 1.033123
C  1.788376 -0.158789 0.573773
C  0.529311 0.418389 0.980265
C  -0.772436 -0.269165 0.724439
C  -1.711753 0.227836 -0.182298
C  -1.130212 -1.34106 1.522161
C  -1.395762 1.373406 -1.097975
C  -2.404776 -1.876957 1.419621
C  -3.263738 -1.296001 0.508342
C  -4.687011 -1.75036 0.339253
C  0.417139 2.358109 -2.258474
C  0.811425 3.563233 -1.436722
C  2.328107 4.317932 0.173229
H  3.225174 -2.686536 -1.216076
H  5.060307 0.24207 1.308536
H  3.828573 -2.117532 1.322366
H  5.186898 -2.018038 0.198335
H  4.572596 -1.11913 -2.401253
H  3.086926 -0.193822 -2.37144
H  4.185381 1.415775 -1.002449
H  5.627692 0.419795 -1.013594
H  -0.42458 -1.756861 2.230141
H  -2.071233 1.335325 -1.960849
H  -1.600784 2.31705 -0.574001
H  -2.698919 -2.712219 2.038455
H  -0.331768 2.667547 -2.997334
H  1.285242 1.996205 -2.815262
H  1.009273 4.395548 -2.127278
H  -0.017846 3.886182 -0.790895
H  1.554811 4.54579 0.916619
H  3.237171 4.028858 0.698676
H  2.537864 5.238796 -0.384543
H  2.031981 1.74328 1.963274
elementType: F O N C H
totalener: -1466.66369852 hartree
nucrepener: 2886.73367347 hartree
electener: -4353.39737199 hartree
oneelecener: -7753.86433840 hartree
twoeener: 3400.46696642 hartree
cpcmener: -0.03880253 hartree
kineticenergy: 1460.85513175 hartree
xcener: -133.540728426293 hartree
chargesum: -0.0000000
charge: -0.177809 -0.173414 -0.178757 -0.459931 -0.308844 -0.449528 -0.340803 -0.361763 -0.346457 0.230749 0.234930 -0.264990 -0.227088 -0.214992 0.182905 0.156071 -0.263879 0.385019 0.065261 0.127399 -0.154613 -0.044262 -0.108887 0.097044 0.495662 -0.001526 0.019123 -0.125540 0.071623 0.083991 0.096359 0.096590 0.101719 0.095823 0.087968 0.100080 0.152560 0.099770 0.119834 0.149784 0.096350 0.094993 0.095149 0.083582 0.103140 0.101699 0.104333 0.273574
qa: -0.1778 -0.1734 -0.1788 -0.4599 -0.3088 -0.4495 -0.3408 -0.3618 -0.3465 0.2307 0.2349 -0.2650 -0.2271 -0.2150 0.1829 0.1561 -0.2639 0.3850 0.0653 0.1274 -0.1546 -0.0443 -0.1089 0.0970 0.4957 -0.0015 0.0191 -0.1255 0.0716 0.0840 0.0964 0.0966 0.1017 0.0958 0.0880 0.1001 0.1526 0.0998 0.1198 0.1498 0.0964 0.0950 0.0951 0.0836 0.1031 0.1017 0.1043 0.2736
va: 1.1192 1.1288 1.1234 2.0241 2.2547 2.0505 1.9649 1.9271 3.1142 3.6787 3.7036 4.0666 3.9442 3.9243 4.0295 3.9705 3.3728 3.8140 3.5646 3.9829 4.0192 4.0035 3.9089 3.8812 4.5123 3.9430 3.8649 3.8929 1.0267 1.0192 1.0141 1.0071 1.0050 1.0113 1.0380 1.0073 0.9998 1.0159 0.9873 1.0048 1.0029 1.0016 1.0026 0.9951 0.9909 0.9969 0.9949 1.0491
dispcorr: -0.028668562 hartree
energy: -1466.692367078088
dipole: 51.62176 -48.18923 3.43253 25.09120 -23.86995 1.22125 -9.44595 9.90467 0.45872
magnitude: 3.67208 au
magnitude: 9.33368 debye
