program: Orca
programVersion: 5.0.2
elementType: F F F O O O O O N C C C C C C C C C C C C C C C C C C C H H H H H H H H H H H H H H H H H H H H
charge: 0
multiplicity: 1
keywords: wb97x-d3
keywords: def2-TZVPP
keywords: def2/J RIJCOSX
keywords: DEFGRID2
keywords: scfconv7
keywords: smallprint printgap noloewdin
keywords: NOSOSCF
formula: C19H20F3NO5
InChI: InChI=1/C19H20F3NO5/c1-27-6-7-28-9-13-12(4-5-14(23-13)19(20,21)22)18(26)15-16(24)10-2-3-11(8-10)17(15)25/h4-5,10-11,24H,2-3,6-9H2,1H3
48 atoms
F  -4.740018 -1.694936 1.390238
F  -5.433509 -1.044237 -0.534501
F  -4.818698 -3.086583 -0.249479
O  0.670404 -1.366649 1.359379
O  3.234784 0.92129 -1.854206
O  0.880725 0.347563 -2.418551
O  -0.428325 2.223197 -0.373208
O  1.870735 3.365651 1.013659
N  -2.725211 -0.292729 0.219548
C  2.983163 -0.951638 1.756424
C  4.217447 0.296956 0.202448
C  3.748888 0.363012 1.650745
C  3.934263 -1.966936 1.075612
C  4.794204 -1.13525 0.104491
C  1.701678 -0.853537 0.960401
C  3.033088 0.371699 -0.6975
C  1.803245 -0.160496 -0.326266
C  0.712158 -0.070752 -1.2675
C  -0.654202 -0.552945 -0.908152
C  -1.515465 0.153385 -0.061133
C  -1.107189 -1.725275 -1.483004
C  -1.1251 1.456057 0.575061
C  -2.375208 -2.195632 -1.172848
C  -3.133788 -1.43858 -0.3052
C  -4.534697 -1.82452 0.078774
C  -0.324835 3.595197 -0.068805
C  0.5776 3.910214 1.109187
C  2.659722 3.914058 -0.013669
H  2.735471 -1.238021 2.77851
H  4.94088 1.062717 -0.078679
H  3.140735 1.240746 1.871221
H  4.607024 0.367563 2.325387
H  4.556023 -2.44009 1.835443
H  3.390704 -2.767583 0.57247
H  4.785969 -1.522663 -0.914638
H  5.835681 -1.107612 0.425812
H  -0.472351 -2.289877 -2.153736
H  -2.036824 1.962149 0.91368
H  -0.518487 1.258487 1.4694
H  -2.736856 -3.11713 -1.605954
H  -1.31336 4.025613 0.14296
H  0.039982 4.076607 -0.978497
H  0.611937 5.005066 1.210437
H  0.149894 3.522675 2.037194
H  2.67224 5.010411 0.022079
H  3.681781 3.56212 0.129012
H  2.335282 3.614359 -1.015048
H  2.382942 0.832705 -2.381806
elementType: F O N C H
totalener: -1466.66036120 hartree
nucrepener: 2881.71648653 hartree
electener: -4348.37684773 hartree
oneelecener: -7743.16753884 hartree
twoeener: 3394.79069111 hartree
cpcmener: -0.03778211 hartree
kineticenergy: 1460.87040068 hartree
xcener: -133.545191998266 hartree
chargesum: -0.0000000
charge: -0.173511 -0.177635 -0.178088 -0.459950 -0.308358 -0.443367 -0.343053 -0.378736 -0.345228 0.245469 0.226847 -0.281365 -0.229839 -0.203302 0.174692 0.126868 -0.224364 0.365048 0.062404 0.111118 -0.123282 -0.028477 -0.137835 0.106983 0.495331 -0.023817 0.028957 -0.133502 0.070359 0.090475 0.099482 0.096991 0.098836 0.094391 0.096833 0.099791 0.153139 0.105643 0.116073 0.150180 0.094332 0.106203 0.089924 0.099025 0.116152 0.107708 0.097852 0.266599
qa: -0.1735 -0.1776 -0.1781 -0.4599 -0.3084 -0.4434 -0.3431 -0.3787 -0.3452 0.2455 0.2268 -0.2814 -0.2298 -0.2033 0.1747 0.1269 -0.2244 0.3650 0.0624 0.1111 -0.1233 -0.0285 -0.1378 0.1070 0.4953 -0.0238 0.0290 -0.1335 0.0704 0.0905 0.0995 0.0970 0.0988 0.0944 0.0968 0.0998 0.1531 0.1056 0.1161 0.1502 0.0943 0.1062 0.0899 0.0990 0.1162 0.1077 0.0979 0.2666
va: 1.1291 1.1180 1.1242 2.0260 2.2419 2.0582 1.9363 1.9021 3.1188 3.6489 3.7077 4.0450 3.9538 3.9555 4.0138 3.9660 3.3434 3.8404 3.5437 3.9962 4.0275 3.9480 3.9392 3.8726 4.5140 3.8870 3.8499 3.8999 1.0284 1.0183 1.0435 1.0099 1.0042 1.0103 1.0131 1.0052 1.0032 1.0161 0.9904 1.0057 1.0048 0.9915 1.0051 0.9957 0.9954 0.9894 0.9876 1.0643
dispcorr: -0.028564158 hartree
energy: -1466.688925354503
dipole: 50.33195 -46.88332 3.44864 24.89047 -23.85107 1.03940 5.62655 -5.74737 -0.12081
magnitude: 3.60389 au
magnitude: 9.16036 debye
