program: Orca
programVersion: 5.0.2
elementType: F F F O O O O O N C C C C C C C C C C C C C C C C C C C H H H H H H H H H H H H H H H H H H H H
charge: 0
multiplicity: 1
keywords: wb97x-d3
keywords: def2-TZVPP
keywords: def2/J RIJCOSX
keywords: DEFGRID2
keywords: scfconv7
keywords: smallprint printgap noloewdin
keywords: NOSOSCF
formula: C19H20F3NO5
InChI: InChI=1/C19H20F3NO5/c1-27-6-7-28-9-13-12(4-5-14(23-13)19(20,21)22)18(26)15-16(24)10-2-3-11(8-10)17(15)25/h4-5,10-11,24H,2-3,6-9H2,1H3
48 atoms
F  -4.430531 -2.441188 -1.235224
F  -4.889432 -2.767904 0.843591
F  -5.332322 -0.874391 -0.078346
O  1.022523 -2.270497 -0.302045
O  3.193279 1.446944 1.587798
O  0.735088 1.235682 1.889614
O  0.377572 1.37009 -1.308863
O  0.521271 4.93246 -0.658589
N  -2.429654 -0.737154 -0.64042
C  3.343433 -1.916438 -0.727528
C  4.42847 -0.096382 0.286562
C  4.452064 -1.621212 0.278875
C  3.646359 -0.925221 -1.877886
C  4.401173 0.247482 -1.221802
C  2.003002 -1.567733 -0.125338
C  3.142242 0.357421 0.885544
C  1.956984 -0.328327 0.651004
C  0.73005 0.246143 1.145279
C  -0.606745 -0.341575 0.828415
C  -1.222453 -0.245157 -0.424375
C  -1.308113 -0.941532 1.859931
C  -0.550146 0.371025 -1.624649
C  -2.564806 -1.476788 1.619653
C  -3.070263 -1.351351 0.341423
C  -4.434479 -1.867099 -0.031804
C  -0.194886 2.632479 -1.032902
C  0.957307 3.614035 -0.874997
C  0.05841 5.181707 0.647655
H  3.319239 -2.952485 -1.065054
H  5.265284 0.366026 0.810157
H  4.282436 -2.06412 1.262002
H  5.413864 -1.982413 -0.090033
H  4.270684 -1.420504 -2.621464
H  2.740477 -0.601894 -2.392862
H  3.939637 1.215244 -1.421075
H  5.428762 0.305198 -1.581559
H  -0.871645 -1.018937 2.847664
H  -0.006526 -0.415439 -2.157077
H  -1.325925 0.735033 -2.308736
H  -3.111598 -1.963233 2.414615
H  -0.815408 2.59514 -0.128605
H  -0.843361 2.950022 -1.85973
H  1.624227 3.281637 -0.067451
H  1.544767 3.624126 -1.796852
H  -0.09179 6.257149 0.746044
H  -0.893887 4.688366 0.869257
H  0.785361 4.868028 1.406709
H  2.259235 1.640379 1.907653
elementType: F O N C H
totalener: -1466.66016846 hartree
nucrepener: 2862.35707094 hartree
electener: -4329.01723940 hartree
oneelecener: -7703.17153564 hartree
twoeener: 3374.15429624 hartree
cpcmener: -0.03512413 hartree
kineticenergy: 1460.83297183 hartree
xcener: -133.537821372746 hartree
chargesum: -0.0000000
charge: -0.172252 -0.177990 -0.177579 -0.454618 -0.308498 -0.450183 -0.368376 -0.388750 -0.344818 0.245577 0.221606 -0.268210 -0.226041 -0.207840 0.146474 0.163980 -0.197123 0.327844 0.038991 0.098665 -0.119120 0.036222 -0.147058 0.106644 0.494114 -0.016418 0.035622 -0.109089 0.070667 0.081947 0.097995 0.097270 0.099493 0.093387 0.094404 0.100321 0.151203 0.117556 0.112845 0.150194 0.102684 0.103682 0.071489 0.098009 0.118260 0.093706 0.089795 0.273319
qa: -0.1723 -0.1780 -0.1776 -0.4546 -0.3085 -0.4502 -0.3684 -0.3887 -0.3448 0.2456 0.2216 -0.2682 -0.2260 -0.2078 0.1465 0.1640 -0.1971 0.3278 0.0390 0.0987 -0.1191 0.0362 -0.1471 0.1066 0.4941 -0.0164 0.0356 -0.1091 0.0707 0.0819 0.0980 0.0973 0.0995 0.0934 0.0944 0.1003 0.1512 0.1176 0.1128 0.1502 0.1027 0.1037 0.0715 0.0980 0.1183 0.0937 0.0898 0.2733
va: 1.1307 1.1242 1.1172 2.0310 2.2550 2.0437 1.9227 1.9328 3.1025 3.6291 3.7402 4.0747 3.9382 3.9448 4.0444 3.9873 3.3221 3.8321 3.5330 3.8638 4.0328 3.8460 3.9577 3.8812 4.5163 3.8268 3.9263 3.9104 1.0256 1.0209 1.0132 1.0078 1.0064 1.0164 1.0156 1.0063 1.0053 0.9953 1.0171 1.0056 0.9911 1.0075 1.0197 1.0007 0.9916 0.9811 0.9919 1.0538
dispcorr: -0.028207102 hartree
energy: -1466.688375563524
dipole: 44.66677 -41.62899 3.03777 24.53751 -24.32859 0.20892 -4.59031 5.52047 0.93016
magnitude: 3.18385 au
magnitude: 8.09271 debye
