program: Orca
programVersion: 5.0.2
elementType: F F F O O O O O N C C C C C C C C C C C C C C C C C C C H H H H H H H H H H H H H H H H H H H H
charge: 0
multiplicity: 1
keywords: wb97x-d3
keywords: def2-TZVPP
keywords: def2/J RIJCOSX
keywords: DEFGRID2
keywords: scfconv7
keywords: smallprint printgap noloewdin
keywords: NOSOSCF
formula: C19H20F3NO5
InChI: InChI=1/C19H20F3NO5/c1-27-6-7-28-9-13-12(4-5-14(23-13)19(20,21)22)18(26)15-16(24)10-2-3-11(8-10)17(15)25/h4-5,10-11,24H,2-3,6-9H2,1H3
48 atoms
F  -4.621284 -3.131358 0.138711
F  -5.359064 -1.539791 1.383389
F  -5.209701 -1.258349 -0.740908
O  0.807939 -1.468937 -1.105335
O  3.088266 1.241756 1.983602
O  0.603164 1.339646 1.970269
O  -0.487175 2.397906 -0.588797
O  2.201726 2.656004 -1.622346
N  -3.006902 -0.041719 0.099243
C  3.167362 -1.66367 -0.87633
C  4.293982 -0.305442 0.662533
C  4.053548 -1.780321 0.357393
C  3.904173 -0.604427 -1.731916
C  4.68568 0.25746 -0.723292
C  1.806034 -1.124938 -0.495089
C  3.00264 0.296335 1.102025
C  1.783645 -0.13631 0.585421
C  0.572209 0.423002 1.140365
C  -0.755388 -0.186221 0.835974
C  -1.817998 0.520509 0.270156
C  -0.97772 -1.493913 1.243423
C  -1.740349 1.969603 -0.147537
C  -2.225989 -2.065806 1.08216
C  -3.204318 -1.285458 0.49361
C  -4.604938 -1.806395 0.309302
C  -0.141545 2.005328 -1.899811
C  1.027068 2.833368 -2.381276
C  2.423011 3.619197 -0.618093
H  3.026614 -2.601314 -1.414191
H  5.055337 -0.115555 1.419347
H  3.593278 -2.327488 1.181793
H  4.996432 -2.272338 0.111789
H  4.584058 -1.111204 -2.416953
H  3.219066 -0.018087 -2.344788
H  4.48267 1.322837 -0.819935
H  5.760855 0.127215 -0.847607
H  -0.179939 -2.067546 1.698094
H  -2.51735 2.142776 -0.902415
H  -1.999962 2.588781 0.717019
H  -2.408094 -3.081378 1.404232
H  -0.978835 2.169431 -2.592431
H  0.103967 0.937536 -1.943714
H  1.245465 2.520286 -3.406968
H  0.742409 3.892515 -2.424463
H  2.374425 4.639982 -1.016243
H  1.719817 3.550746 0.215655
H  3.430089 3.46523 -0.228632
H  2.153417 1.556611 2.182224
elementType: F O N C H
totalener: -1466.66002216 hartree
nucrepener: 2896.35327917 hartree
electener: -4363.01330133 hartree
oneelecener: -7772.16856369 hartree
twoeener: 3409.15526236 hartree
cpcmener: -0.03471491 hartree
kineticenergy: 1460.84372418 hartree
xcener: -133.540225935846 hartree
chargesum: -0.0000000
charge: -0.178482 -0.178391 -0.169598 -0.461821 -0.305112 -0.444114 -0.358886 -0.386162 -0.348660 0.236335 0.246123 -0.263916 -0.230753 -0.240495 0.169045 0.166097 -0.230798 0.341641 0.033986 0.137370 -0.142026 0.001335 -0.138633 0.113572 0.496721 -0.011014 0.026718 -0.112011 0.073578 0.084774 0.096239 0.096978 0.101888 0.091697 0.103747 0.102741 0.158399 0.102306 0.115607 0.151249 0.105334 0.097326 0.095188 0.086794 0.110069 0.092365 0.095736 0.269911
qa: -0.1785 -0.1784 -0.1696 -0.4618 -0.3051 -0.4441 -0.3589 -0.3862 -0.3487 0.2363 0.2461 -0.2639 -0.2308 -0.2405 0.1690 0.1661 -0.2308 0.3416 0.0340 0.1374 -0.1420 0.0013 -0.1386 0.1136 0.4967 -0.0110 0.0267 -0.1120 0.0736 0.0848 0.0962 0.0970 0.1019 0.0917 0.1037 0.1027 0.1584 0.1023 0.1156 0.1512 0.1053 0.0973 0.0952 0.0868 0.1101 0.0924 0.0957 0.2699
va: 1.1225 1.1143 1.1356 2.0053 2.2559 2.0570 1.9374 1.8990 3.0873 3.6667 3.6887 4.0680 3.9408 3.9475 4.0092 3.9533 3.3610 3.7929 3.5656 3.8506 3.9847 3.8986 3.9825 3.8807 4.5128 3.8560 3.9205 3.8911 1.0267 1.0191 1.0152 1.0077 1.0058 1.0204 1.0198 1.0080 0.9945 1.0183 0.9967 1.0054 1.0065 0.9978 1.0000 1.0070 0.9975 0.9992 0.9887 1.0593
dispcorr: -0.029844886 hartree
energy: -1466.689867049865
dipole: 50.55658 -47.31079 3.24578 20.17717 -20.36770 -0.19054 -11.65303 11.83476 0.18173
magnitude: 3.25644 au
magnitude: 8.27722 debye
