program: Orca
programVersion: 5.0.2
elementType: F F F O O O O O N C C C C C C C C C C C C C C C C C C C H H H H H H H H H H H H H H H H H H H H
charge: 0
multiplicity: 1
keywords: wb97x-d3
keywords: def2-TZVPP
keywords: def2/J RIJCOSX
keywords: DEFGRID2
keywords: scfconv7
keywords: smallprint printgap noloewdin
keywords: NOSOSCF
formula: C19H20F3NO5
InChI: InChI=1/C19H20F3NO5/c1-27-6-7-28-9-13-12(4-5-14(23-13)19(20,21)22)18(26)15-16(24)10-2-3-11(8-10)17(15)25/h4-5,10-11,24H,2-3,6-9H2,1H3
48 atoms
F  -4.863136 -3.04276 0.167966
F  -5.379951 -0.997887 0.602613
F  -4.68616 -1.535106 -1.357467
O  3.313329 0.728202 1.860158
O  0.647295 -1.520001 -1.293374
O  1.071336 -0.159127 2.583296
O  -0.29379 2.027563 0.89945
O  1.000243 3.636002 -1.294935
N  -2.648638 -0.305952 -0.019687
C  4.082986 0.475138 -0.363023
C  2.79359 -0.702034 -1.92812
C  3.413398 0.67411 -1.718249
C  4.814342 -0.877164 -0.54297
C  3.94164 -1.664242 -1.540243
C  3.024769 0.296525 0.670126
C  1.637259 -0.885608 -0.971284
C  1.81811 -0.316474 0.366245
C  0.810456 -0.394554 1.400811
C  -0.586539 -0.781587 1.051567
C  -1.421142 0.055157 0.299874
C  -1.087394 -1.986096 1.505056
C  -0.96898 1.41017 -0.169247
C  -2.375298 -2.364374 1.15409
C  -3.100495 -1.487995 0.374429
C  -4.511769 -1.774738 -0.056549
C  -0.122519 3.424695 0.820728
C  1.118191 3.873097 0.086192
C  2.043555 4.224062 -2.030572
H  4.75515 1.280124 -0.064517
H  2.433315 -0.877036 -2.941969
H  2.680371 1.481756 -1.726267
H  4.16122 0.88651 -2.484194
H  5.804695 -0.681938 -0.954527
H  4.960874 -1.400872 0.401955
H  3.571934 -2.603015 -1.126435
H  4.510425 -1.918209 -2.434692
H  -0.473856 -2.646631 2.104172
H  -0.33184 1.301242 -1.055851
H  -1.850595 1.983628 -0.47736
H  -2.777091 -3.310403 1.487238
H  -0.035965 3.780477 1.850339
H  -1.009958 3.903845 0.387799
H  1.244876 4.947101 0.287836
H  2.003123 3.367345 0.499936
H  3.031973 3.867979 -1.716131
H  1.905555 3.965337 -3.080318
H  2.03773 5.317513 -1.941131
H  2.556541 0.481905 2.46683
elementType: F O N C H
totalener: -1466.66016280 hartree
nucrepener: 2871.42550314 hartree
electener: -4338.08566594 hartree
oneelecener: -7722.32579877 hartree
twoeener: 3384.24013283 hartree
cpcmener: -0.03798220 hartree
kineticenergy: 1460.86685617 hartree
xcener: -133.541849976989 hartree
chargesum: 0.0000000
charge: -0.178090 -0.176923 -0.173933 -0.307671 -0.457260 -0.441979 -0.346103 -0.370396 -0.342722 0.227685 0.240559 -0.261854 -0.208356 -0.222539 0.133599 0.144503 -0.193545 0.335588 0.057442 0.108170 -0.107816 -0.015314 -0.136745 0.107011 0.495360 0.007627 0.011831 -0.129727 0.087784 0.073179 0.076852 0.104428 0.100039 0.097090 0.093650 0.099609 0.152759 0.110272 0.108614 0.150130 0.101075 0.083639 0.102064 0.075385 0.091688 0.119693 0.107070 0.266578
qa: -0.1781 -0.1769 -0.1739 -0.3077 -0.4573 -0.4420 -0.3461 -0.3704 -0.3427 0.2277 0.2406 -0.2619 -0.2084 -0.2225 0.1336 0.1445 -0.1935 0.3356 0.0574 0.1082 -0.1078 -0.0153 -0.1367 0.1070 0.4954 0.0076 0.0118 -0.1297 0.0878 0.0732 0.0769 0.1044 0.1000 0.0971 0.0937 0.0996 0.1528 0.1103 0.1086 0.1501 0.1011 0.0836 0.1021 0.0754 0.0917 0.1197 0.1071 0.2666
va: 1.1244 1.1193 1.1288 2.2420 2.0266 2.0538 1.9492 1.9097 3.1256 3.7177 3.6938 4.0790 3.9498 3.9503 3.9795 4.0297 3.3043 3.9017 3.5279 3.9719 4.0125 3.9126 3.9397 3.8679 4.5132 3.9258 3.8877 3.8881 1.0205 1.0280 1.0281 1.0066 1.0048 1.0123 1.0118 1.0036 1.0034 1.0038 1.0188 1.0054 0.9991 1.0086 1.0039 0.9973 0.9851 0.9899 0.9942 1.0588
dispcorr: -0.028012799 hartree
energy: -1466.688175601437
dipole: 50.87489 -46.83636 4.03853 26.81495 -25.55437 1.26057 -9.40063 9.18739 -0.21324
magnitude: 4.23606 au
magnitude: 10.76722 debye
