program: Orca
programVersion: 5.0.2
elementType: F F F O O O O O N C C C C C C C C C C C C C C C C C C C H H H H H H H H H H H H H H H H H H H H
charge: 0
multiplicity: 1
keywords: wb97x-d3
keywords: def2-TZVPP
keywords: def2/J RIJCOSX
keywords: DEFGRID2
keywords: scfconv7
keywords: smallprint printgap noloewdin
keywords: NOSOSCF
formula: C19H20F3NO5
InChI: InChI=1/C19H20F3NO5/c1-27-6-7-28-9-13-12(4-5-14(23-13)19(20,21)22)18(26)15-16(24)10-2-3-11(8-10)17(15)25/h4-5,10-11,24H,2-3,6-9H2,1H3
48 atoms
F  -5.150812 -0.961121 0.048423
F  -4.958466 -2.558399 -1.379916
F  -4.202517 -2.801411 0.62122
O  3.503599 0.822788 -2.000568
O  0.776934 -1.793455 0.803326
O  1.101634 0.639629 -2.559348
O  0.056847 1.949878 -0.039479
O  -0.412165 3.679106 2.34262
N  -2.514146 -0.429922 -0.018851
C  4.450261 -0.278555 -0.131347
C  3.097714 -1.567299 1.28721
C  4.295551 -1.716221 0.354967
C  4.363012 0.5343 1.181646
C  3.456066 -0.303779 2.103065
C  3.271935 0.056842 -0.981025
C  1.844897 -1.299847 0.482449
C  1.999115 -0.409457 -0.668839
C  0.90366 -0.012224 -1.526643
C  -0.492328 -0.472407 -1.262759
C  -1.29819 0.034571 -0.237766
C  -1.0267 -1.430002 -2.105521
C  -0.832871 1.132281 0.674652
C  -2.306792 -1.912086 -1.873705
C  -2.992053 -1.390077 -0.795704
C  -4.336612 -1.923275 -0.382192
C  1.012247 2.663235 0.712604
C  0.486594 3.95361 1.297337
C  -1.021501 4.837142 2.857233
H  5.368779 -0.086497 -0.685948
H  2.922584 -2.435459 1.922429
H  4.140028 -2.434539 -0.451858
H  5.182457 -2.023781 0.912398
H  5.366108 0.630288 1.597584
H  3.988531 1.545543 1.020757
H  2.570865 0.2422 2.432499
H  3.99153 -0.602802 3.004326
H  -0.443205 -1.825337 -2.927473
H  -1.70869 1.681754 1.032841
H  -0.350228 0.68866 1.556761
H  -2.730366 -2.671271 -2.515412
H  1.822673 2.912781 0.022935
H  1.435305 2.033915 1.506979
H  1.344005 4.54034 1.659689
H  0.006581 4.548277 0.506565
H  -1.623408 5.358023 2.102323
H  -1.680065 4.536951 3.672123
H  -0.287343 5.550301 3.253845
H  2.622826 0.952781 -2.47825
elementType: F O N C H
totalener: -1466.66069666 hartree
nucrepener: 2848.95015431 hartree
electener: -4315.61085097 hartree
oneelecener: -7677.21090187 hartree
twoeener: 3361.60005091 hartree
cpcmener: -0.03900639 hartree
kineticenergy: 1460.85075099 hartree
xcener: -133.541404914122 hartree
chargesum: -0.0000000
charge: -0.171430 -0.178615 -0.177445 -0.313005 -0.459040 -0.444706 -0.360796 -0.372027 -0.346582 0.253499 0.245010 -0.275592 -0.246427 -0.241473 0.173954 0.194662 -0.305004 0.423197 0.043405 0.144149 -0.140211 -0.056914 -0.142850 0.105993 0.496602 0.067096 0.020407 -0.118363 0.084136 0.072167 0.098227 0.096971 0.104040 0.101397 0.103694 0.104525 0.152140 0.098774 0.113944 0.150453 0.098475 0.070295 0.085204 0.080306 0.095131 0.113535 0.091598 0.267494
qa: -0.1714 -0.1786 -0.1774 -0.3130 -0.4590 -0.4447 -0.3608 -0.3720 -0.3466 0.2535 0.2450 -0.2756 -0.2464 -0.2415 0.1740 0.1947 -0.3050 0.4232 0.0434 0.1441 -0.1402 -0.0569 -0.1428 0.1060 0.4966 0.0671 0.0204 -0.1184 0.0841 0.0722 0.0982 0.0970 0.1040 0.1014 0.1037 0.1045 0.1521 0.0988 0.1139 0.1505 0.0985 0.0703 0.0852 0.0803 0.0951 0.1135 0.0916 0.2675
va: 1.1328 1.1232 1.1151 2.2453 2.0319 2.0596 1.9501 1.9295 3.1005 3.6945 3.6331 4.0795 3.9540 3.9268 3.9609 3.9907 3.3565 3.7790 3.6030 3.9209 4.0391 4.0328 3.9523 3.8807 4.5062 3.8535 3.9730 3.9127 1.0192 1.0267 1.0127 1.0076 1.0086 1.0109 1.0086 1.0064 1.0048 1.0260 0.9970 1.0061 0.9969 1.0220 0.9999 0.9993 0.9897 0.9936 0.9890 1.0663
dispcorr: -0.027433020 hartree
energy: -1466.688129683595
dipole: 43.92238 -39.97313 3.94925 28.12867 -27.11029 1.01838 17.03901 -16.75547 0.28354
magnitude: 4.08828 au
magnitude: 10.39159 debye
