program: Orca
programVersion: 5.0.2
elementType: F F F O O O O O N C C C C C C C C C C C C C C C C C C C H H H H H H H H H H H H H H H H H H H H
charge: 0
multiplicity: 1
keywords: wb97x-d3
keywords: def2-TZVPP
keywords: def2/J RIJCOSX
keywords: DEFGRID2
keywords: scfconv7
keywords: smallprint printgap noloewdin
keywords: NOSOSCF
formula: C19H20F3NO5
InChI: InChI=1/C19H20F3NO5/c1-27-6-7-28-9-13-12(4-5-14(23-13)19(20,21)22)18(26)15-16(24)10-2-3-11(8-10)17(15)25/h4-5,10-11,26H,2-3,6-9H2,1H3
48 atoms
F  5.377006 0.954933 -0.200565
F  4.8837 2.847523 -1.095678
F  4.56198 2.531211 1.008934
O  -1.009002 1.944428 0.877119
O  -3.072419 -1.473824 -1.596226
O  -0.679622 -1.132894 -1.909648
O  0.051333 -1.735908 1.117774
O  -0.882258 -4.382343 1.507972
N  2.615032 0.650373 0.485808
C  -3.340791 1.526423 1.157049
C  -4.376698 -0.207281 -0.05539
C  -4.067837 0.202822 1.381384
C  -4.223888 2.233409 0.102192
C  -4.920494 1.099494 -0.675703
C  -1.973222 1.264108 0.571169
C  -3.096461 -0.569616 -0.745473
C  -1.902045 0.172116 -0.40078
C  -0.712606 -0.211684 -0.99954
C  0.61781 0.400657 -0.768839
C  1.405602 0.136462 0.35833
C  1.143585 1.198211 -1.770233
C  0.919212 -0.709318 1.507155
C  2.408869 1.746801 -1.619484
C  3.095332 1.439223 -0.463658
C  4.484645 1.951213 -0.190724
C  0.702571 -2.869515 0.579902
C  -0.320761 -3.93742 0.298782
C  -1.89474 -5.33553 1.311129
H  -3.221144 2.123659 2.061191
H  -5.077762 -1.03714 -0.147292
H  -3.474885 -0.534501 1.926786
H  -4.99342 0.363085 1.937757
H  -4.955909 2.858582 0.614013
H  -3.646566 2.894396 -0.545639
H  -4.748792 1.153776 -1.751353
H  -6.000362 1.13085 -0.528334
H  0.567042 1.412487 -2.660987
H  1.79059 -1.092488 2.051101
H  0.369544 -0.067385 2.202074
H  2.823664 2.380505 -2.389823
H  1.459288 -3.244961 1.281538
H  1.223526 -2.632264 -0.356122
H  -1.097748 -3.550145 -0.375946
H  0.179866 -4.757984 -0.234457
H  -2.727689 -4.938486 0.717478
H  -1.525315 -6.237817 0.8078
H  -2.28099 -5.624872 2.288813
H  -1.639957 -1.472606 -2.01697
elementType: F O N C H
totalener: -1466.66230546 hartree
nucrepener: 2840.31064941 hartree
electener: -4306.97295487 hartree
oneelecener: -7659.50874531 hartree
twoeener: 3352.53579044 hartree
cpcmener: -0.03652026 hartree
kineticenergy: 1460.84448352 hartree
xcener: -133.538584676252 hartree
chargesum: 0.0000000
charge: -0.175536 -0.177421 -0.173265 -0.459768 -0.453870 -0.314774 -0.359801 -0.374946 -0.341281 0.212939 0.211388 -0.256602 -0.222501 -0.219094 0.192518 0.175463 -0.204477 0.327370 0.037838 0.087446 -0.117502 0.042689 -0.133744 0.105694 0.494413 0.005114 0.018965 -0.110715 0.073013 0.076287 0.096135 0.095801 0.098637 0.093409 0.095261 0.099001 0.154667 0.109577 0.118107 0.151788 0.102313 0.096752 0.070277 0.087551 0.090650 0.089924 0.115078 0.269229
qa: -0.1755 -0.1774 -0.1733 -0.4598 -0.4539 -0.3148 -0.3598 -0.3749 -0.3413 0.2129 0.2114 -0.2566 -0.2225 -0.2191 0.1925 0.1755 -0.2045 0.3274 0.0378 0.0874 -0.1175 0.0427 -0.1337 0.1057 0.4944 0.0051 0.0190 -0.1107 0.0730 0.0763 0.0961 0.0958 0.0986 0.0934 0.0953 0.0990 0.1547 0.1096 0.1181 0.1518 0.1023 0.0968 0.0703 0.0876 0.0906 0.0899 0.1151 0.2692
va: 1.1232 1.1258 1.1293 2.0263 2.0658 2.2235 1.9352 1.9187 3.1102 3.7006 3.7600 4.0448 3.9390 3.9385 4.0215 4.0349 3.3743 3.7888 3.5336 3.8993 4.0219 3.8482 3.9321 3.8897 4.5179 3.8952 3.9505 3.9106 1.0282 1.0264 1.0175 1.0066 1.0034 1.0118 1.0118 1.0036 1.0034 1.0180 1.0001 1.0049 1.0077 0.9981 1.0082 0.9982 0.9902 0.9889 0.9917 1.0708
dispcorr: -0.026486094 hartree
energy: -1466.688791550703
dipole: -48.44037 45.85370 -2.58668 -25.31768 24.78411 -0.53358 4.80275 -6.10851 -1.30576
magnitude: 2.94629 au
magnitude: 7.48887 debye
