program: Orca
programVersion: 5.0.2
elementType: F F F O O O O O N C C C C C C C C C C C C C C C C C C C H H H H H H H H H H H H H H H H H H H H
charge: 0
multiplicity: 1
keywords: wb97x-d3
keywords: def2-TZVPP
keywords: def2/J RIJCOSX
keywords: DEFGRID2
keywords: scfconv7
keywords: smallprint printgap noloewdin
keywords: NOSOSCF
formula: C19H20F3NO5
InChI: InChI=1/C19H20F3NO5/c1-27-6-7-28-9-13-12(4-5-14(23-13)19(20,21)22)18(26)15-16(24)10-2-3-11(8-10)17(15)25/h4-5,10-11,26H,2-3,6-9H2,1H3
48 atoms
F  5.038789 1.658749 1.079677
F  5.426529 1.490576 -1.028038
F  4.624825 3.319429 -0.224019
O  -0.839009 1.439822 1.321974
O  -2.92564 -1.41086 -1.769825
O  -0.500135 -1.176819 -1.903358
O  0.375347 -1.94611 0.905496
O  -2.30113 -3.155987 0.893507
N  2.987183 0.228122 0.087204
C  -3.217524 1.293408 1.276224
C  -4.270076 -0.185916 -0.228285
C  -4.07033 0.026818 1.269341
C  -3.928881 2.195459 0.242476
C  -4.640847 1.229321 -0.725411
C  -1.826584 0.967824 0.787143
C  -2.963976 -0.580975 -0.847433
C  -1.760334 0.060055 -0.362197
C  -0.560848 -0.296168 -0.955948
C  0.743977 0.345146 -0.676399
C  1.803334 -0.338417 -0.075919
C  0.95904 1.637336 -1.125902
C  1.671747 -1.749867 0.415863
C  2.204201 2.219876 -0.963096
C  3.179874 1.462865 -0.343198
C  4.573077 1.989427 -0.124629
C  0.125432 -3.285217 1.270776
C  -1.275607 -3.407902 1.823498
C  -2.524094 -4.205878 -0.016153
H  -3.140515 1.764709 2.256097
H  -5.024546 -0.931216 -0.480218
H  -3.602925 -0.821308 1.77221
H  -5.030579 0.212116 1.754972
H  -4.65113 2.82703 0.76012
H  -3.236331 2.866544 -0.267593
H  -4.363489 1.391554 -1.767659
H  -5.723293 1.346075 -0.666041
H  0.16089 2.189989 -1.604366
H  1.895405 -2.442067 -0.409847
H  2.430058 -1.925994 1.18871
H  2.38439 3.226995 -1.310456
H  0.8230 -3.607832 2.05551
H  0.281143 -3.956031 0.414711
H  -1.376896 -4.411498 2.258385
H  -1.405732 -2.690108 2.637651
H  -3.436516 -3.98381 -0.568805
H  -1.712007 -4.328526 -0.740654
H  -2.665267 -5.164456 0.4978
H  -1.460233 -1.495458 -2.063789
elementType: F O N C H
totalener: -1466.66126125 hartree
nucrepener: 2879.75001499 hartree
electener: -4346.41127624 hartree
oneelecener: -7739.44465468 hartree
twoeener: 3393.03337845 hartree
cpcmener: -0.03630709 hartree
kineticenergy: 1460.87110989 hartree
xcener: -133.545249654931 hartree
chargesum: 0.0000000
charge: -0.171349 -0.176933 -0.177107 -0.455542 -0.450475 -0.313476 -0.338692 -0.372256 -0.349083 0.237652 0.236789 -0.275048 -0.230309 -0.212925 0.181724 0.145898 -0.279819 0.437230 0.025775 0.131864 -0.134984 -0.031864 -0.121167 0.109882 0.496309 0.013073 0.013350 -0.123748 0.070299 0.077004 0.093363 0.097508 0.097959 0.094054 0.093901 0.098478 0.156104 0.114682 0.098710 0.150828 0.093149 0.091631 0.091554 0.086887 0.104303 0.098727 0.107126 0.268963
qa: -0.1713 -0.1769 -0.1771 -0.4555 -0.4505 -0.3135 -0.3387 -0.3723 -0.3491 0.2377 0.2368 -0.2750 -0.2303 -0.2129 0.1817 0.1459 -0.2798 0.4372 0.0258 0.1319 -0.1350 -0.0319 -0.1212 0.1099 0.4963 0.0131 0.0134 -0.1237 0.0703 0.0770 0.0934 0.0975 0.0980 0.0941 0.0939 0.0985 0.1561 0.1147 0.0987 0.1508 0.0931 0.0916 0.0916 0.0869 0.1043 0.0987 0.1071 0.2690
va: 1.1320 1.1188 1.1252 2.0266 2.0579 2.2316 1.9720 1.9123 3.1071 3.6476 3.7358 4.0364 3.9450 3.9450 4.0403 4.0209 3.3403 3.7102 3.5866 3.9786 3.9884 3.9919 3.9419 3.8836 4.5077 3.8526 3.9346 3.9060 1.0274 1.0241 1.0317 1.0080 1.0045 1.0109 1.0126 1.0038 0.9990 0.9924 1.0114 1.0055 0.9992 0.9914 1.0042 1.0027 0.9964 0.9826 0.9962 1.0715
dispcorr: -0.028272581 hartree
energy: -1466.689533832076
dipole: -50.54130 48.04511 -2.49619 -24.72621 23.78339 -0.94282 5.41195 -5.83819 -0.42624
magnitude: 2.70214 au
magnitude: 6.86830 debye
