program: Orca
programVersion: 5.0.2
elementType: F F F O O O O O N C C C C C C C C C C C C C C C C C C C H H H H H H H H H H H H H H H H H H H H
charge: 0
multiplicity: 1
keywords: wb97x-d3
keywords: def2-TZVPP
keywords: def2/J RIJCOSX
keywords: DEFGRID2
keywords: scfconv7
keywords: smallprint printgap noloewdin
keywords: NOSOSCF
formula: C19H20F3NO5
InChI: InChI=1/C19H20F3NO5/c1-27-6-7-28-9-13-12(4-5-14(23-13)19(20,21)22)18(26)15-16(24)10-2-3-11(8-10)17(15)25/h4-5,10-11,26H,2-3,6-9H2,1H3
48 atoms
F  4.682443 2.212961 0.841777
F  5.069578 0.295251 -0.054065
F  4.256456 1.88975 -1.245289
O  -1.047196 2.128699 -0.438042
O  -3.64953 -1.18558 1.648113
O  -1.231306 -1.385543 1.820401
O  -0.766348 -1.631873 -1.324918
O  1.873911 -2.850821 -0.618233
N  2.138649 0.333763 -0.682928
C  -3.411888 2.130511 -0.718726
C  -4.729449 0.51071 0.37425
C  -4.490425 2.018213 0.355931
C  -3.930876 1.19679 -1.837171
C  -4.836261 0.169001 -1.127682
C  -2.101537 1.585111 -0.190685
C  -3.519154 -0.177501 0.940591
C  -2.215603 0.352993 0.603233
C  -1.107622 -0.353318 1.0469
C  0.296276 0.030566 0.779307
C  0.907963 -0.089783 -0.473579
C  1.045427 0.530868 1.829897
C  0.191619 -0.663426 -1.666978
C  2.340114 0.968387 1.602447
C  2.823436 0.868625 0.311712
C  4.215471 1.325813 -0.045507
C  -0.362107 -2.977523 -1.417437
C  0.627023 -3.432261 -0.365304
C  2.778285 -2.973827 0.441358
H  -3.240603 3.147635 -1.070215
H  -5.607437 0.197469 0.9394
H  -4.187113 2.425786 1.322728
H  -5.398311 2.542666 0.049195
H  -4.496371 1.778455 -2.565634
H  -3.115619 0.721921 -2.384814
H  -4.554179 -0.862228 -1.340653
H  -5.875184 0.281295 -1.44048
H  0.612797 0.613489 2.818496
H  -0.334117 0.155502 -2.168829
H  0.941971 -1.04057 -2.367833
H  2.931499 1.382291 2.405789
H  0.046803 -3.19121 -2.414342
H  -1.273815 -3.568877 -1.307863
H  0.256122 -3.169506 0.634442
H  0.685681 -4.532011 -0.403545
H  3.689932 -2.447596 0.162823
H  2.389812 -2.527977 1.366117
H  3.030823 -4.021183 0.652404
H  -2.239179 -1.536209 1.93464
totalener: -1466.63270658 hartree
nucrepener: 2922.63243085 hartree
electener: -4389.26513742 hartree
oneelecener: -7823.88060034 hartree
twoeener: 3434.61546292 hartree
kineticenergy: 1460.92209942 hartree
xcener: -133.549153817120 hartree
chargesum: 0.0000000
charge: -0.176375 -0.170821 -0.152856 -0.350501 -0.381658 -0.300354 -0.332042 -0.312247 -0.260862 0.239292 0.188541 -0.278430 -0.224923 -0.219187 0.084079 0.143871 -0.224488 0.311592 0.132499 0.092450 -0.155853 -0.011723 -0.106797 0.046587 0.495692 0.003762 -0.016254 -0.128398 0.081976 0.080534 0.092437 0.088496 0.092147 0.091233 0.095641 0.092658 0.123315 0.105898 0.115121 0.131386 0.079422 0.084774 0.089803 0.086506 0.115879 0.081136 0.097641 0.239399
qa: -0.1764 -0.1708 -0.1529 -0.3505 -0.3817 -0.3004 -0.3320 -0.3122 -0.2609 0.2393 0.1885 -0.2784 -0.2249 -0.2192 0.0841 0.1439 -0.2245 0.3116 0.1325 0.0924 -0.1559 -0.0117 -0.1068 0.0466 0.4957 0.0038 -0.0163 -0.1284 0.0820 0.0805 0.0924 0.0885 0.0921 0.0912 0.0956 0.0927 0.1233 0.1059 0.1151 0.1314 0.0794 0.0848 0.0898 0.0865 0.1159 0.0811 0.0976 0.2394
va: 1.1247 1.1211 1.1610 2.1270 2.1469 2.2317 1.9603 1.9569 3.0685 3.5755 3.7277 4.0403 3.9211 3.9284 4.1014 4.0698 3.3092 3.8354 3.4579 3.8859 4.0709 3.8753 3.9426 3.9608 4.5013 3.9550 3.8831 3.9206 1.0255 1.0269 1.0150 1.0093 1.0068 1.0197 1.0169 1.0072 1.0145 0.9937 1.0227 1.0133 1.0057 1.0030 1.0013 1.0061 0.9991 0.9897 0.9948 1.1117
dispcorr: -0.029688797 hartree
energy: -1466.662395373526
dipole: -37.46987 35.70969 -1.76018 -17.27138 16.73676 -0.53462 -4.39092 4.85371 0.46279
magnitude: 1.89690 au
magnitude: 4.82153 debye
