program: Orca
programVersion: 5.0.2
elementType: F F F O O O O O N C C C C C C C C C C C C C C C C C C C H H H H H H H H H H H H H H H H H H H H
charge: 0
multiplicity: 1
keywords: wb97x-d3
keywords: def2-TZVPP
keywords: def2/J RIJCOSX
keywords: DEFGRID2
keywords: scfconv7
keywords: smallprint printgap noloewdin
keywords: NOSOSCF
formula: C19H20F3NO5
InChI: InChI=1/C19H20F3NO5/c1-27-6-7-28-9-13-12(4-5-14(23-13)19(20,21)22)18(26)15-16(24)10-2-3-11(8-10)17(15)25/h4-5,10-11,24H,2-3,6-9H2,1H3
48 atoms
F  -4.503858 -2.925716 -1.129264
F  -5.010168 -3.104748 0.955289
F  -5.54372 -1.326418 -0.138781
O  0.789615 -1.669947 -1.014635
O  2.823688 1.382307 1.924016
O  0.379755 1.159633 2.016295
O  -0.3667 1.708563 -0.91517
O  1.993488 3.235329 -0.330876
N  -2.794708 -0.795321 -0.54348
C  3.156813 -1.491006 -0.964953
C  4.151434 0.072346 0.466362
C  4.149624 -1.432437 0.192595
C  3.646154 -0.347027 -1.8858
C  4.317131 0.677448 -0.947933
C  1.75901 -1.176934 -0.46529
C  2.816287 0.449607 1.0249
C  1.655228 -0.155304 0.572524
C  0.39775 0.307859 1.119242
C  -0.899118 -0.374508 0.825742
C  -1.637318 -0.196393 -0.345892
C  -1.435663 -1.190326 1.805784
C  -1.175945 0.702179 -1.453186
C  -2.641047 -1.84234 1.585831
C  -3.27475 -1.611767 0.380976
C  -4.592213 -2.249015 0.014832
C  0.357941 2.427562 -1.871158
C  0.998547 3.632558 -1.229687
C  2.559596 4.312188 0.362122
H  3.125482 -2.447551 -1.486474
H  4.933642 0.405403 1.149211
H  3.860161 -2.03418 1.054448
H  5.139989 -1.766347 -0.125544
H  4.365134 -0.742025 -2.60457
H  2.838139 0.091129 -2.472672
H  3.881673 1.671833 -1.024228
H  5.38107 0.774229 -1.168661
H  -0.911782 -1.335044 2.740888
H  -0.632294 0.092431 -2.188477
H  -2.055316 1.114141 -1.964425
H  -3.060521 -2.494268 2.337961
H  -0.299259 2.789418 -2.675533
H  1.124404 1.797784 -2.346621
H  1.416266 4.265821 -2.027815
H  0.223002 4.227226 -0.725304
H  3.027694 5.041712 -0.311513
H  1.817298 4.845192 0.969567
H  3.325461 3.917037 1.027032
H  1.864249 1.428335 2.287813
totalener: -1466.63357036 hartree
nucrepener: 2896.87062682 hartree
electener: -4363.50419718 hartree
oneelecener: -7772.72132830 hartree
twoeener: 3409.21713112 hartree
kineticenergy: 1460.86933330 hartree
xcener: -133.537382320540 hartree
chargesum: 0.0000000
charge: -0.161086 -0.178704 -0.164031 -0.377988 -0.305578 -0.380959 -0.305115 -0.311852 -0.302855 0.223852 0.230171 -0.278376 -0.256548 -0.223505 0.145437 0.149574 -0.268275 0.370764 0.058051 0.158517 -0.134339 -0.065574 -0.121709 0.064799 0.496221 -0.002314 0.022827 -0.114703 0.082125 0.083555 0.091489 0.087863 0.096008 0.101508 0.091826 0.092419 0.122941 0.113901 0.099939 0.132035 0.091424 0.072203 0.067677 0.074689 0.087899 0.099190 0.093112 0.251498
qa: -0.1611 -0.1787 -0.1640 -0.3780 -0.3056 -0.3810 -0.3051 -0.3119 -0.3029 0.2239 0.2302 -0.2784 -0.2565 -0.2235 0.1454 0.1496 -0.2683 0.3708 0.0581 0.1585 -0.1343 -0.0656 -0.1217 0.0648 0.4962 -0.0023 0.0228 -0.1147 0.0821 0.0836 0.0915 0.0879 0.0960 0.1015 0.0918 0.0924 0.1229 0.1139 0.0999 0.1320 0.0914 0.0722 0.0677 0.0747 0.0879 0.0992 0.0931 0.2515
va: 1.1467 1.1214 1.1408 2.1053 2.2486 2.1318 1.9865 1.9870 3.1233 3.6220 3.6708 4.0587 3.9425 3.9020 4.0196 3.9596 3.4168 3.8160 3.6413 3.9623 4.0568 3.9978 3.9283 3.9748 4.5101 3.9577 3.9577 3.9160 1.0256 1.0203 1.0171 1.0101 1.0086 1.0113 1.0509 1.0104 1.0116 0.9918 1.0153 1.0123 1.0001 0.9988 0.9959 1.0022 0.9904 0.9937 1.0048 1.0894
dispcorr: -0.029010569 hartree
energy: -1466.662580925162
dipole: 51.90536 -49.24374 2.66162 28.40336 -27.40423 0.99914 -8.40810 8.41496 0.00686
magnitude: 2.84298 au
magnitude: 7.22628 debye
