program: Orca
programVersion: 5.0.2
elementType: F F F O O O O O N C C C C C C C C C C C C C C C C C C C H H H H H H H H H H H H H H H H H H H H
charge: 0
multiplicity: 1
keywords: wb97x-d3
keywords: def2-TZVPP
keywords: def2/J RIJCOSX
keywords: DEFGRID2
keywords: scfconv7
keywords: smallprint printgap noloewdin
keywords: NOSOSCF
formula: C19H20F3NO5
InChI: InChI=1/C19H20F3NO5/c1-27-6-7-28-9-13-12(4-5-14(23-13)19(20,21)22)18(26)15-16(24)10-2-3-11(8-10)17(15)25/h4-5,10-11,24H,2-3,6-9H2,1H3
48 atoms
F  -4.850689 -2.85958 0.402971
F  -5.333611 -1.216416 1.706474
F  -5.244204 -0.9105 -0.420863
O  0.849445 -1.375373 -1.210061
O  3.253582 0.855975 2.158338
O  0.812714 0.834216 2.334505
O  -0.349567 2.300699 -0.149992
O  1.728107 2.601685 -2.100079
N  -2.939438 0.088393 0.630235
C  3.227729 -1.406596 -1.243867
C  4.408487 -0.263261 0.424998
C  4.255049 -1.668706 -0.148018
C  3.796353 -0.152798 -1.94385
C  4.560388 0.611444 -0.843647
C  1.875338 -1.068016 -0.641066
C  3.135269 0.106557 1.110881
C  1.905659 -0.313654 0.618141
C  0.724423 0.102611 1.341511
C  -0.641271 -0.390306 1.005679
C  -1.692869 0.5018 0.775371
C  -0.932604 -1.741008 1.071559
C  -1.460507 1.987783 0.639084
C  -2.242404 -2.168149 0.930323
C  -3.208609 -1.202208 0.718368
C  -4.670835 -1.54827 0.595005
C  -0.509706 1.983027 -1.513481
C  0.376702 2.871121 -2.349558
C  2.582852 3.459102 -2.797974
H  3.089124 -2.237964 -1.935015
H  5.239836 -0.142404 1.12018
H  3.937986 -2.406304 0.59156
H  5.199678 -2.012019 -0.575731
H  4.473741 -0.464539 -2.739975
H  3.014909 0.45101 -2.401608
H  4.176215 1.620034 -0.691185
H  5.620003 0.705417 -1.084265
H  -0.146409 -2.463705 1.245166
H  -2.383829 2.428628 0.242081
H  -1.280234 2.42584 1.622803
H  -2.486511 -3.218779 0.981969
H  -1.545078 2.159856 -1.837636
H  -0.290454 0.926869 -1.707708
H  0.130882 2.697273 -3.408665
H  0.140871 3.924049 -2.135306
H  2.453545 3.38551 -3.885935
H  2.437338 4.50912 -2.513536
H  3.609332 3.181286 -2.559142
H  2.308154 1.055969 2.470386
totalener: -1466.63637005 hartree
nucrepener: 2870.19926097 hartree
electener: -4336.83563102 hartree
oneelecener: -7719.04745059 hartree
twoeener: 3382.21181957 hartree
kineticenergy: 1460.91688466 hartree
xcener: -133.544726947071 hartree
chargesum: 0.0000000
charge: -0.176978 -0.165754 -0.157859 -0.365024 -0.277664 -0.383495 -0.317488 -0.313213 -0.285412 0.244848 0.209870 -0.276989 -0.240603 -0.244382 0.098351 0.155297 -0.198913 0.275167 0.057107 0.074667 -0.101464 0.010073 -0.112803 0.064463 0.495314 -0.005822 0.024250 -0.108062 0.079932 0.085353 0.088761 0.088594 0.095959 0.098491 0.100168 0.095244 0.122294 0.099764 0.108871 0.130926 0.086467 0.104451 0.061217 0.065597 0.089075 0.096183 0.083056 0.242117
qa: -0.1770 -0.1658 -0.1579 -0.3650 -0.2777 -0.3835 -0.3175 -0.3132 -0.2854 0.2448 0.2099 -0.2770 -0.2406 -0.2444 0.0984 0.1553 -0.1989 0.2752 0.0571 0.0747 -0.1015 0.0101 -0.1128 0.0645 0.4953 -0.0058 0.0242 -0.1081 0.0799 0.0854 0.0888 0.0886 0.0960 0.0985 0.1002 0.0952 0.1223 0.0998 0.1089 0.1309 0.0865 0.1045 0.0612 0.0656 0.0891 0.0962 0.0831 0.2421
va: 1.1232 1.1360 1.1521 2.1011 2.2870 2.1368 1.9669 1.9815 3.1006 3.6288 3.7112 4.0585 3.8881 3.9491 4.0804 4.0226 3.3002 3.9083 3.5595 3.8869 4.0030 3.8535 3.9748 3.9670 4.5115 3.9247 3.9775 3.9270 1.0250 1.0222 1.0174 1.0105 1.0066 1.0473 1.0126 1.0069 1.0063 1.0134 1.0053 1.0131 1.0035 0.9972 0.9944 1.0002 0.9896 0.9950 0.9946 1.1033
dispcorr: -0.027786748 hartree
energy: -1466.664156799356
dipole: 50.12393 -47.65656 2.46737 20.07926 -20.05416 0.02510 -20.00442 19.28324 -0.72118
magnitude: 2.57073 au
magnitude: 6.53428 debye
