program: Gaussian 09
title: 000059425
version: EM64L-G09RevD.01
frameworkgroup: C1[X(C15H25NO2)]
method: RPBEPBE
basis: SDD
operation: Freq
keyword: #p
keyword: freq=noraman
keyword: PBEPBE/SDD
title: #p freq=noraman PBEPBE/SDD
converged: NO YES NO NO
title: Mulliken charges:
elementType: O O N C C C C C C C C C C C C C C C H H H H H H H H H H H H H H H H H H H H H H H H H
charge: -0.267515 -0.249152 -0.354606 0.369103 -0.087964 -0.092214 -0.084523 -0.514906 -0.496583 -0.546114 -0.451651 -0.450642 -0.449957 -0.382680 -0.522868 0.252087 -0.228556 -0.672808 0.194680 0.192265 0.194108 0.198767 0.215917 0.184467 0.212181 0.222107 0.181309 0.193974 0.194440 0.194776 0.193442 0.189231 0.195522 0.228189 0.238403 0.194882 0.230068 0.257546 0.227934 0.227133 0.210872 0.230210 0.229125
chargesum: 0.00000
title: Mulliken charges with hydrogens summed into heavy atoms:
elementType: O O N C C C C C C C C C C C C C C C
charge: -0.267515 -0.249152 -0.126417 0.369103 0.106717 0.100051 0.109585 -0.100223 -0.099935 -0.142697 -0.063237 -0.062423 -0.065204 0.050604 -0.035254 0.252087 0.226511 -0.002601
polarizability: 2.11714039e+02 2.57155308e+00 1.50726607e+02 -2.50961422e+00 6.41082634e-03 1.38410712e+02
1716.lowfreq: -15.6363 -6.4277 -2.0510 -0.0002 0.0005 0.0008 16.1049 30.8119 42.6904
frequency: -13.3988 29.8704 42.1897 47.7764 69.4647 111.2234 129.9364 166.9381 179.9428 224.3460 250.8080 258.1274 298.0763 298.9712 346.8785 371.8085 386.7639 390.9387 395.0564 414.1836 431.0067 436.7109 469.8826 554.9224 593.4811 633.3432 637.2323 657.1128 694.3042 712.9943 768.1684 793.8790 798.0355 807.7881 810.8848 816.0307 868.1167 869.3809 878.5718 904.1071 926.6975 935.4908 945.9609 967.6921 973.6450 977.8045 1022.4537 1035.6541 1039.9237 1046.0565 1047.9418 1069.8050 1076.0184 1097.7180 1099.0064 1100.9891 1105.3397 1110.7905 1113.7705 1134.1604 1138.0282 1149.5921 1171.7287 1182.2921 1188.9337 1248.2781 1250.5346 1258.8050 1274.0677 1280.8344 1285.9342 1291.1599 1301.7276 1305.4049 1311.2849 1312.8795 1323.7556 1340.3810 1341.9829 1350.4549 1354.4081 1357.1306 1361.4683 1378.2539 1399.0743 1445.2415 1448.3220 1452.7903 1457.5608 1461.5423 1462.9407 1463.7683 1467.1215 1473.7153 1483.4990 1486.8774 1493.8667 1634.7701 2891.1006 2948.6231 2955.6329 2960.7280 2962.3199 2963.3623 2973.6178 2989.5226 2993.5419 2994.8063 2997.0047 3005.1475 3008.9720 3014.9660 3017.8115 3020.2227 3026.3141 3027.5992 3036.6327 3052.0378 3066.8186 3072.8368 3091.3090 3106.5727 3397.4621
redmass: 3.4724 3.7510 3.2399 3.8817 2.6928 2.6606 2.7856 2.4237 3.6496 3.5783 1.5708 1.9313 2.3908 2.2181 3.7743 2.2708 3.0935 4.5666 3.6875 2.2462 1.8909 1.7667 2.4911 3.2308 3.4274 3.6356 3.2835 2.0340 3.1196 4.2272 3.3384 1.3658 1.1834 2.6365 2.7026 2.7168 1.5899 1.5763 1.5467 4.3999 3.3601 2.0234 2.2569 2.1719 2.1619 2.3830 2.3022 2.1698 1.8134 2.0270 1.7424 3.5608 2.2373 1.4206 1.1152 1.3199 1.3535 1.0185 2.1720 1.6823 2.0035 2.8759 1.4940 1.1851 1.1783 1.1667 1.4385 1.4911 1.6177 1.8208 1.8945 1.8081 2.0267 1.6295 1.4463 1.6869 1.3150 1.4411 1.4433 1.4865 1.3792 1.5780 1.5761 1.5110 1.2707 1.0850 1.0889 1.1078 1.1968 1.1020 1.0405 1.1096 1.0894 1.0599 1.0919 1.0685 1.0819 9.8140 1.0719 1.0628 1.0615 1.0635 1.0607 1.0615 1.0617 1.0834 1.0833 1.0359 1.0612 1.0834 1.0581 1.1020 1.1013 1.1021 1.1001 1.1017 1.1014 1.0921 1.1065 1.0939 1.0985 1.1025 1.0734
irintensity: 0.6139 0.1537 0.0595 1.0103 0.6854 1.9449 0.8368 5.3848 2.5988 6.6148 1.1653 2.6746 4.1294 2.1948 8.2639 5.6705 0.7012 0.1770 1.2145 2.1551 1.4792 1.6257 8.3790 12.7174 12.5159 2.9321 8.0063 42.7445 12.2055 3.3080 0.9372 8.4924 1.0527 4.0628 4.3426 3.0320 0.1314 0.1801 0.0764 11.2475 15.9934 2.3636 13.6958 2.9302 6.1348 1.0286 50.8149 9.4746 20.6991 2.0949 0.0210 99.4654 30.9022 21.4176 8.6691 4.4538 29.6041 0.4766 4.1323 87.5155 173.4516 14.1634 56.3438 2.9363 0.9971 7.1323 31.8639 28.8821 9.7520 10.1353 0.8792 3.6703 15.9053 14.2016 34.7245 8.6172 0.0263 1.3357 2.0616 9.6233 1.3532 0.7538 2.0542 33.3487 16.6664 20.3519 0.0566 0.5384 6.8288 18.1819 11.6513 17.4179 13.9206 5.1770 0.6427 13.0588 4.1317 159.5805 63.1173 21.8161 59.1724 22.7938 26.1462 21.4318 47.8841 148.6736 167.3421 22.4540 16.0140 43.5669 19.1637 4.5331 4.9678 28.2758 54.7465 98.5120 63.0061 0.5759 8.1168 26.3536 31.2859 45.7669 4.2803
temp: 298.150 k
press: 1.00000 atm
elementType: 8 8 7 6 6 6 6 6 6 6 6 6 6 6 6 6 6 6 1 1 1 1 1 1 1 1 1 1 1 1 1 1 1 1 1 1 1 1 1 1 1 1 1
symmnumber: 1
zpe: 994943.4 jmol-1
zpe.correction: 0.378954 hartree
zpe.thermalcorrener: 0.395553 hartree
zpe.thermalcorrenthalpy: 0.396497 hartree
zpe.thermalcorrgfe: 0.334125 hartree
zpe.sumelectzpe: -790.382288 hartree
zpe.sumelectthermal: -790.365689 hartree
zpe.sumelectthermalent: -790.364745 hartree
zpe.sumelectthermalfe: -790.427116 hartree
dipole: -0.4231 -1.3762 0.9242
dipole: 1.7109
quadrupole: -93.1792 -113.7189 -109.4418
quadrupole: 2.6116 -1.0793 -1.1984
quadrupole: 12.2674 -8.2723 -3.9952 2.6116 -1.0793 -1.1984
hfenergy: -790.7612417 hartree
pointgroup: C01 [X(C15H25N1O2)]
dipole: 0.165187 0.4462525 0.4760636 debye
polarizability: 211.7027084|2.7955878|150.1505043|2.2666778|2.7468567|138.9981455 unknown
InChI: InChI=1S/C15H25NO2/c1-2-18-14(17)3-4-16-15-8-11-5-12(9-15)7-13(6-11)10-15/h11-13,16H,2-10H2,1H3
charge 0 multiplicity 1
43 atoms
O  4.831328 0.45111 -0.000192
O  3.578307 -1.424543 -0.580567
N  0.002683 0.970117 -0.017661
C  -1.381339 0.411002 0.028054
C  -3.121828 -0.958057 -1.241639
C  -3.138963 -0.957235 1.294408
C  -3.839243 1.119365 0.018672
C  -1.653265 -0.452891 -1.236845
C  -1.669424 -0.452741 1.299527
C  -2.367364 1.612705 0.019154
C  -3.380241 -1.819192 0.025146
C  -4.088241 0.25566 -1.248373
C  -4.101307 0.260181 1.286494
C  1.135848 0.027878 0.11047
C  2.454455 0.752139 -0.227779
C  3.631457 -0.205647 -0.29101
C  6.071437 -0.38315 -0.090146
C  7.241679 0.525425 0.271005
H  -3.290661 -1.571815 -2.148548
H  -3.321431 -1.569399 2.200262
H  -4.517366 1.995674 0.013604
H  -0.967359 -1.322465 -1.267586
H  -1.446411 0.161777 -2.134282
H  -1.480364 0.158899 2.206998
H  -0.977849 -1.31806 1.335452
H  -2.162119 2.234067 -0.874291
H  -2.182057 2.246673 0.913067
H  -2.707863 -2.700868 0.030199
H  -4.42088 -2.201655 0.018215
H  -3.925923 0.863707 -2.160929
H  -5.140035 -0.094216 -1.268739
H  -3.946665 0.870978 2.199124
H  -5.1543 -0.086173 1.299203
H  0.091933 1.748227 0.654292
H  1.001922 -0.798703 -0.607287
H  1.227054 -0.439519 1.11978
H  2.681054 1.558675 0.492917
H  2.340788 1.235108 -1.218441
H  5.965821 -1.236854 0.603548
H  6.145474 -0.784573 -1.117218
H  8.187695 -0.044032 0.218714
H  7.310101 1.377454 -0.426789
H  7.131363 0.922467 1.294617
