program: Gaussian 09
title: 000006272
version: EM64L-G09RevD.01
frameworkgroup: C1[X(C9H10INO3)]
method: RPBEPBE
basis: SDD
operation: Freq
keyword: #p
keyword: freq=noraman
keyword: PBEPBE/SDD
title: #p freq=noraman PBEPBE/SDD
converged: YES YES NO NO
title: Mulliken charges:
elementType: I O O O N C C C C C C C C C H H H H H H H H H H
charge: 0.095676 -0.412747 -0.403513 -0.251034 -0.552913 -0.586273 -0.201617 0.500593 -0.340117 -0.394770 0.190040 -0.532140 -0.313501 0.393461 0.229420 0.241732 0.270182 0.280483 0.240632 0.281856 0.290071 0.256410 0.375983 0.342085
chargesum: 0.00000
title: Mulliken charges with hydrogens summed into heavy atoms:
elementType: I O O O N C C C C C C C C C
charge: 0.095676 -0.036764 -0.061428 -0.251034 0.019014 -0.115120 0.068565 0.500593 -0.059634 -0.154138 0.190040 -0.532140 -0.057091 0.393461
polarizability: 1.81590954e+02 2.28272030e+01 1.40826854e+02 -1.58915492e+01 1.09854068e+01 8.53868596e+01
1716.lowfreq: -8.5135 -5.6289 -0.0005 -0.0005 -0.0003 4.9846 19.7111 26.5116 52.8866
frequency: 19.1496 26.4459 52.8863 69.8565 126.1064 143.0461 170.9205 206.9614 230.6083 252.0330 275.3707 312.4068 342.7734 355.8947 435.5171 442.5054 459.2732 464.2015 521.7559 568.7201 588.7596 600.1651 629.3130 654.7611 705.4712 711.7353 771.3725 780.8138 832.5263 852.2413 896.2702 952.1042 961.6513 990.8039 1016.4300 1045.9926 1095.8353 1113.1098 1140.0365 1164.9861 1203.0850 1215.3128 1244.2966 1252.7711 1305.3366 1317.5203 1342.4708 1363.0627 1380.6619 1407.0665 1467.2937 1478.8967 1570.4798 1610.0741 1635.8671 1646.8854 3004.0043 3057.0430 3074.2855 3131.4344 3159.3623 3171.1547 3456.3490 3456.4882 3497.7302 3588.9634
redmass: 7.4442 7.1574 10.0542 5.2666 5.2770 6.4446 5.4359 9.4971 3.7662 3.6577 2.4498 2.0036 2.1943 5.0650 1.4976 1.8440 4.0278 3.7508 4.2569 3.2242 1.8149 2.0694 1.4796 7.1689 4.0425 3.9721 4.3210 3.5621 1.5980 4.0880 1.4799 1.8149 1.3831 2.7326 3.1615 2.2006 2.9163 1.5881 1.2502 1.3605 1.4673 1.6809 1.5626 2.8122 1.4354 1.5112 1.6305 1.3852 5.2541 2.8043 1.1169 3.1328 6.0759 7.0106 1.1125 7.1376 1.0605 1.0891 1.0990 1.0897 1.0925 1.0953 1.0448 1.0647 1.0639 1.0987
irintensity: 0.2188 1.4842 1.4915 0.3787 0.2469 0.6342 0.2025 1.2493 4.2304 6.5054 15.7144 26.3671 10.9737 5.0136 110.4984 30.0694 30.0203 26.6327 42.2068 41.6778 130.3640 100.5702 132.0095 13.6604 41.9000 10.8384 16.0695 8.4151 25.0457 12.0555 12.0150 22.9244 1.7402 59.5893 15.2655 219.9497 17.8689 24.2604 22.9381 207.7521 11.6945 5.5465 4.9722 21.2081 14.7152 10.5957 6.0326 10.3681 13.1649 6.5383 16.4830 136.1105 13.2576 14.6087 47.8858 167.9075 19.6406 5.7129 14.1534 11.3547 0.7188 5.2623 2.2787 61.2429 18.4908 5.2495
temp: 298.150 k
press: 1.00000 atm
elementType: 53 8 8 8 7 6 6 6 6 6 6 6 6 6 1 1 1 1 1 1 1 1 1 1
symmnumber: 1
zpe: 466655.5 jmol-1
zpe.correction: 0.177740 hartree
zpe.thermalcorrener: 0.192100 hartree
zpe.thermalcorrenthalpy: 0.193044 hartree
zpe.thermalcorrgfe: 0.133175 hartree
zpe.sumelectzpe: -639.847952 hartree
zpe.sumelectthermal: -639.833592 hartree
zpe.sumelectthermalent: -639.832648 hartree
zpe.sumelectthermalfe: -639.892517 hartree
dipole: 2.1462 -0.7444 0.7233
dipole: 2.3840
quadrupole: -81.9108 -96.9262 -96.8556
quadrupole: 0.3332 1.4258 -3.6207
quadrupole: 9.9867 -5.0287 -4.9581 0.3332 1.4258 -3.6207
hfenergy: -640.0256916 hartree
pointgroup: C01 [X(C9H10I1N1O3)]
dipole: -0.8700601 0.0106263 0.3501603 debye
dipolederiv: -0.1670003 -0.1422109 0.0058293 -0.1942217 -0.3951851 0.1181362 0.0123543 0.1168771 -0.0324149 -0.4116877 0.0307721 0.1297483 0.089445 -0.2779198 -0.2939528 0.1918355 -0.2284684 -1.1672807 -1.3061899 -0.1131007 -0.2086105 -0.1371836 -0.2391873 -0.0976563 -0.2604332 -0.1009376 -0.4261976 -0.4002977 0.0839648 0.0379445 -0.0565677 -0.7691884 0.2569853 0.2257041 0.0873888 -0.7538773 -0.6882583 -0.1272325 -0.0282871 -0.1878311 -0.8156913 -0.1772142 0.0185244 -0.1680752 -0.2192731 -0.0081889 0.0098529 0.0176491 -0.0017262 0.0370402 -0.036722 0.1482377 0.0330078 0.1021743 0.5398387 -0.0209953 0.0073754 -0.0172401 0.2255241 0.0208138 -0.1044549 -0.0078215 0.1170802 0.1954157 -0.0257809 0.0515759 0.1485284 -0.0960212 0.0306258 0.0373686 -0.0228241 -0.1055549 -0.0916005 0.0414235 -0.0089737 -0.2779611 -0.2180804 0.0019668 0.0956518 0.0949897 -0.075195 -0.0075788 -0.0908952 0.1034139 0.0429108 0.0858009 -0.067757 0.0436731 -0.1237111 -0.082049 0.1568923 -0.0262113 -0.1664884 -0.076769 0.941933 0.022574 -0.3804506 0.1203351 1.4750253 -0.0255229 0.3697188 -0.0939649 0.6735509 0.7867948 -0.2199021 -0.2064844 -0.2675541 -0.1358341 -0.1607781 0.1767231 -0.0609909 -0.2563874 0.019394 -0.1401002 0.1025281 -0.0044968 -0.1143979 1.0493063 -0.1178165 0.3449888 0.1268834 -0.1947434 0.161378 0.2799146 0.0776056 0.1478116 0.0010829 -0.0045053 -0.0438817 0.034744 0.0519249 0.1203878 -0.0589486 0.0415022 -0.0338593 0.0143394 -0.0193809 -0.008633 -0.0299081 -0.0900539 -0.061014 -0.0034283 -0.0314651 0.0686044 0.0488 0.0176283 -0.0405233 0.0082631 0.020309 0.0523878 -0.0684538 0.0440973 -0.0472636 0.1191003 0.0456609 -0.0628087 0.047353 0.0579245 0.0414814 -0.0624146 0.0371351 0.117475 0.0619142 -0.1070614 0.0027878 -0.0917729 -0.0495975 0.0478193 -0.0018362 0.0399972 0.1228725 0.1763647 0.0018471 -0.0054035 0.0430225 0.2310337 0.1766546 -0.0276242 0.1184032 0.1508664 0.0620521 0.0209319 0.04563 0.1312464 0.3552984 -0.056018 0.0437382 -0.0226702 0.0901486 0.034279 0.0277971 -0.052168 0.031339 0.00739 0.0751894 -0.0616932 0.0726395 0.1243384 0.3990446 0.007332 0.0069399 0.0174919 0.0767763 0.010633 -0.0071724 0.0648213 0.3165698 0.4086727 -0.0384616 0.0268507 -0.0672096 0.2485244 0.0133034 0.0438642 0.0292243 0.3602308 unknown
polarizability: 161.426405|32.2479801|157.968153|7.5493443|-20.789155|88.4101101 unknown
InChI: InChI=1S/C9H10INO3/c10-6-3-5(1-2-8(6)12)4-7(11)9(13)14/h1-3,7,12-13H,4,11H2
charge 0 multiplicity 1
24 atoms
I  2.945121 2.617306 -0.917622
O  -2.565001 1.109935 1.845191
O  4.111978 -0.123532 0.593241
O  -2.326731 1.757012 -0.374948
N  -3.745734 -1.110115 -0.164911
C  -1.385844 -1.020051 -0.9323
C  -2.38384 -0.670624 0.201711
C  0.066585 -0.763938 -0.558274
C  0.681938 0.481521 -0.843622
C  0.833046 -1.757449 0.106125
C  -2.383406 0.843038 0.480946
C  2.020344 0.714091 -0.46978
C  2.168482 -1.523809 0.478747
C  2.784439 -0.27968 0.195791
H  -1.662212 -0.434084 -1.829369
H  -1.546743 -2.08798 -1.163956
H  -2.092201 -1.191384 1.12902
H  0.106001 1.262373 -1.349715
H  0.379701 -2.731077 0.326904
H  -4.110606 -0.670627 -1.016784
H  -4.420263 -1.102648 0.606043
H  2.768035 -2.285211 0.986141
H  -2.622528 2.094601 1.987647
H  4.44484 0.782034 0.346375
