program: Gaussian 09
title: 000059401
version: EM64L-G09RevD.01
frameworkgroup: C1[X(C13H19N3O)]
method: RPBEPBE
basis: SDD
operation: Freq
keyword: #p
keyword: freq=noraman
keyword: PBEPBE/SDD
title: #p freq=noraman PBEPBE/SDD
converged: YES YES NO NO
title: Mulliken charges:
elementType: O N N N C C C C C C C C C C C C C H H H H H H H H H H H H H H H H H H H
charge: -0.286423 -0.296578 -0.285119 -0.029810 -0.368711 -0.345669 -0.430258 -0.342457 0.197102 -0.263690 0.435136 -0.689393 -0.383019 -0.385387 -0.214372 -0.194124 -0.267459 0.216123 0.178348 0.176086 0.206347 0.201083 0.246704 0.191950 0.193753 0.267445 0.235896 0.235295 0.216281 0.208893 0.212413 0.224605 0.270232 0.220514 0.222335 0.225928
chargesum: 0.00000
title: Mulliken charges with hydrogens summed into heavy atoms:
elementType: O N N N C C C C C C C C C C C C C
charge: -0.286423 -0.029133 -0.285119 -0.029810 0.025760 0.036764 0.017530 0.043247 0.197102 0.207501 0.435136 -0.051806 -0.158414 -0.115155 0.006142 0.028210 -0.041532
polarizability: 2.73196131e+02 1.00178208e+01 1.53336622e+02 -2.27564419e+01 5.48540818e+00 1.05926515e+02
1716.lowfreq: -7.3905 -5.8194 -3.5718 -0.0010 -0.0005 0.0005 12.6431 31.7522 36.7862
frequency: 11.5629 31.5789 36.3625 51.8674 70.6068 78.7856 111.3003 128.7792 132.8856 147.9287 169.3133 213.4910 227.0793 236.6056 280.7880 302.7888 346.2948 411.1216 426.1904 438.9223 489.3313 501.9338 591.4568 613.2694 661.6793 672.5683 692.8261 716.9467 736.3138 752.0258 799.2648 807.0202 819.1833 861.0938 884.0217 893.9392 927.1114 931.2002 959.4184 960.1042 978.7087 984.3253 995.8687 1022.9276 1030.1285 1042.5540 1067.1567 1079.0289 1082.3799 1111.6381 1113.1660 1122.7906 1127.9254 1155.1629 1169.8753 1187.2098 1199.6121 1223.3117 1240.4695 1266.4247 1274.1641 1282.1100 1322.8403 1324.6997 1347.5059 1350.9454 1380.3854 1388.8101 1390.7363 1400.1664 1450.3703 1453.4904 1465.0177 1467.9616 1474.0469 1477.8716 1485.6304 1495.0319 1498.0193 1516.8120 1582.0582 1621.4950 1627.8069 2837.8514 2843.7720 2943.7078 2958.9745 2967.8201 2973.8524 2991.1340 2998.2790 3008.0102 3041.9727 3047.5832 3070.8428 3073.6756 3122.1595 3131.3625 3143.4206 3163.5751 3180.6993 3441.1589
redmass: 4.8581 3.6267 1.8096 4.5901 3.5958 4.2028 2.1144 3.1334 3.2179 2.8309 3.0195 4.8748 4.0114 1.1130 4.2175 3.0846 6.0341 2.9277 4.1986 3.1423 4.8594 3.0046 6.6812 6.4720 7.0450 1.4043 1.9157 3.7455 1.0739 1.7617 1.3883 2.8393 1.2640 8.7714 1.4395 1.8570 9.5226 1.2102 2.3908 1.3516 5.6590 1.3051 3.6710 2.9683 2.3125 2.0416 2.6329 2.3038 1.4270 2.3758 1.0584 2.3933 3.0116 1.9102 1.0502 1.1236 1.5662 1.7784 1.6875 1.2835 1.1522 1.0804 1.3261 1.3312 1.4848 1.5023 1.6726 4.8083 1.2861 2.5072 2.5337 1.1567 1.1090 1.0807 1.0672 1.0433 1.0683 1.0902 1.8209 1.5147 6.4964 6.1538 10.0094 1.0715 1.0707 1.0549 1.0630 1.0614 1.0362 1.0837 1.1134 1.0982 1.1014 1.0862 1.1006 1.0995 1.0849 1.0879 1.0941 1.0983 1.0961 1.0744
irintensity: 0.0604 0.7358 0.5659 0.6145 0.1033 0.7376 1.5753 2.0207 1.4053 1.2873 7.2262 0.1903 0.2301 0.0435 0.3786 7.7259 3.9201 0.0180 1.9634 1.5955 1.2432 12.6249 7.5834 0.3849 19.7109 89.7129 40.9964 13.5463 10.7857 88.1431 19.3248 58.1397 0.2867 7.0675 9.2598 6.9922 28.3341 3.6058 5.3458 0.1382 7.9480 1.1838 9.1504 4.0632 20.3307 8.2285 26.1801 0.5245 2.9116 33.6720 1.9648 26.1770 112.5411 5.6675 1.1833 11.0800 8.9765 36.1790 93.2091 1.8513 1.9474 0.5713 47.0456 0.6782 17.3755 25.4133 22.2877 9.1511 20.5027 42.5962 6.9789 64.6755 3.2686 1.7298 1.0315 12.7298 11.0863 9.1565 181.8424 59.0650 10.6980 247.7329 13.7197 32.0536 184.5304 70.3345 3.8859 56.0823 38.3180 46.5426 44.8019 3.0440 44.6751 10.5062 85.2472 56.9112 13.1859 4.0946 38.2472 28.5341 2.9505 0.4622
temp: 298.150 k
press: 1.00000 atm
elementType: 8 7 7 7 6 6 6 6 6 6 6 6 6 6 6 6 6 1 1 1 1 1 1 1 1 1 1 1 1 1 1 1 1 1 1 1
symmnumber: 1
zpe: 791589.6 jmol-1
zpe.correction: 0.301501 hartree
zpe.thermalcorrener: 0.319050 hartree
zpe.thermalcorrenthalpy: 0.319994 hartree
zpe.thermalcorrgfe: 0.252673 hartree
zpe.sumelectzpe: -744.909663 hartree
zpe.sumelectthermal: -744.892114 hartree
zpe.sumelectthermalent: -744.891170 hartree
zpe.sumelectthermalfe: -744.958490 hartree
dipole: 1.5410 1.6953 -0.7714
dipole: 2.4174
quadrupole: -95.0465 -95.6366 -105.8999
quadrupole: -4.3871 -4.3912 2.0379
quadrupole: 3.8145 3.2244 -7.0389 -4.3871 -4.3912 2.0379
hfenergy: -745.2111638 hartree
pointgroup: C01 [X(C13H19N3O1)]
dipole: 0.6111417 0.6388704 0.3505566 debye
polarizability: 274.1310737|21.0788173|117.7319195|-3.3631001|22.1140168|140.5962742 unknown
InChI: InChI=1S/C13H19N3O/c1-2-3-9-14-10-13-15-16(11-17-13)12-7-5-4-6-8-12/h4-8,14H,2-3,9-11H2,1H3
charge 0 multiplicity 1
36 atoms
O  0.265254 1.314589 0.852647
N  2.762677 0.01034 -0.044203
N  -1.71154 0.357023 0.161212
N  -0.71135 0.000636 -0.777326
C  5.132905 -0.567153 0.442221
C  4.135705 -0.014701 -0.593711
C  1.750485 0.536812 -0.987133
C  6.584523 -0.613325 -0.086633
C  0.395822 0.562728 -0.359851
C  -1.148769 1.163091 1.270702
C  -3.039009 -0.066397 0.04282
C  7.580468 -1.167343 0.954851
C  -3.989999 0.302873 1.037569
C  -3.451247 -0.861791 -1.06443
C  -5.331107 -0.119489 0.916992
C  -4.793825 -1.272361 -1.163849
C  -5.74629 -0.907838 -0.179834
H  4.805519 -1.58098 0.743351
H  5.099178 0.061909 1.357539
H  4.48129 0.995311 -0.93736
H  4.134913 -0.669542 -1.488557
H  1.994916 1.566849 -1.356155
H  1.6952 -0.121338 -1.872341
H  6.897757 0.405551 -0.393509
H  6.619384 -1.239264 -1.001586
H  2.718283 0.502864 0.859121
H  -1.613734 2.165805 1.351649
H  -1.186458 0.637249 2.247214
H  8.60977 -1.198955 0.552996
H  7.592187 -0.5393 1.865685
H  7.304076 -2.194144 1.259662
H  -3.691115 0.911833 1.8986
H  -2.712964 -1.141546 -1.820032
H  -6.053464 0.170872 1.688544
H  -5.100752 -1.884808 -2.019598
H  -6.788089 -1.232961 -0.267069
