program: Orca
programVersion: 5.0.2
elementType: F F F O O O O O N C C C C C C C C C C C C C C C C C C C H H H H H H H H H H H H H H H H H H H H
charge: 0
multiplicity: 1
keywords: wb97x-d3
keywords: def2-TZVPP
keywords: def2/J RIJCOSX
keywords: DEFGRID2
keywords: scfconv7
keywords: smallprint printgap noloewdin
keywords: NOSOSCF
formula: C19H20F3NO5
InChI: InChI=1/C19H20F3NO5/c1-27-6-7-28-9-13-12(4-5-14(23-13)19(20,21)22)18(26)15-16(24)10-2-3-11(8-10)17(15)25/h4-5,10-11,24H,2-3,6-9H2,1H3
48 atoms
F  -5.037019 -2.886343 -1.261875
F  -4.700806 -2.527754 0.835903
F  -5.567537 -0.991021 -0.392642
O  3.029859 1.222338 -1.980409
O  0.715839 -1.640827 0.946736
O  0.606962 1.000127 -2.280976
O  -0.291238 1.830997 0.587175
O  2.5004 3.916464 1.506058
N  -2.819586 -0.571173 0.220104
C  4.22086 -0.021005 -0.354214
C  3.087116 -1.488569 1.079084
C  4.147935 -1.508323 -0.015971
C  4.310882 0.639858 1.041658
C  3.564043 -0.328953 1.981799
C  2.937041 0.362264 -1.015277
C  1.726714 -1.145226 0.496442
C  1.725316 -0.168579 -0.596547
C  0.52989 0.23528 -1.314216
C  -0.812566 -0.362806 -1.036822
C  -1.620151 -0.048828 0.06152
C  -1.325913 -1.227592 -1.986615
C  -1.175436 0.895045 1.13799
C  -2.580157 -1.791386 -1.806538
C  -3.280327 -1.430281 -0.673227
C  -4.656433 -1.964627 -0.369684
C  0.568752 2.433934 1.512978
C  1.409284 3.455665 0.758063
C  2.173061 4.823113 2.522462
H  5.053074 0.255012 -1.002271
H  2.991698 -2.426736 1.625464
H  3.889478 -2.137059 -0.869886
H  5.105561 -1.858048 0.376559
H  5.362105 0.721806 1.320478
H  3.906424 1.651728 1.061261
H  2.739491 0.146598 2.513447
H  4.235875 -0.721221 2.74609
H  -0.746396 -1.475722 -2.866274
H  -2.056992 1.376688 1.576614
H  -0.695003 0.308068 1.932609
H  -2.983943 -2.478315 -2.535259
H  1.23034 1.689868 1.980918
H  -0.001292 2.911025 2.323109
H  1.821198 2.985341 -0.136562
H  0.773259 4.286511 0.421119
H  1.633122 4.361534 3.357572
H  3.104325 5.232001 2.912591
H  1.564501 5.656188 2.148687
H  2.08547 1.352449 -2.330781
totalener: -1466.63279693 hartree
nucrepener: 2862.10523836 hartree
electener: -4328.73803528 hartree
oneelecener: -7702.33830674 hartree
twoeener: 3373.60027146 hartree
kineticenergy: 1460.91255262 hartree
xcener: -133.547088134359 hartree
chargesum: -0.0000000
charge: -0.178138 -0.160179 -0.163608 -0.281282 -0.362614 -0.369792 -0.319149 -0.331121 -0.299892 0.255177 0.244060 -0.283910 -0.250645 -0.265035 0.091844 0.133139 -0.247295 0.335007 0.069767 0.144163 -0.119886 -0.080160 -0.129278 0.070695 0.496820 -0.001794 0.014905 -0.116157 0.086411 0.083700 0.093454 0.090062 0.094806 0.109831 0.108590 0.097669 0.122886 0.103211 0.115050 0.132423 0.066746 0.100997 0.093089 0.089529 0.082868 0.108798 0.081594 0.242644
qa: -0.1781 -0.1602 -0.1636 -0.2813 -0.3626 -0.3698 -0.3191 -0.3311 -0.2999 0.2552 0.2441 -0.2839 -0.2506 -0.2650 0.0918 0.1331 -0.2473 0.3350 0.0698 0.1442 -0.1199 -0.0802 -0.1293 0.0707 0.4968 -0.0018 0.0149 -0.1162 0.0864 0.0837 0.0935 0.0901 0.0948 0.1098 0.1086 0.0977 0.1229 0.1032 0.1151 0.1324 0.0667 0.1010 0.0931 0.0895 0.0829 0.1088 0.0816 0.2426
va: 1.1221 1.1482 1.1414 2.2718 2.1207 2.1415 1.9816 1.9582 3.1272 3.6285 3.5812 4.0575 3.9117 3.9314 3.9919 4.0248 3.3344 3.8321 3.6216 3.9619 4.0518 4.0219 3.9396 3.9704 4.5084 3.8746 3.8889 3.9427 1.0201 1.0244 1.0156 1.0108 1.0117 1.0424 1.0061 1.0083 1.0123 1.0158 0.9895 1.0131 0.9955 0.9936 1.0183 1.0063 0.9795 0.9956 0.9931 1.1021
dispcorr: -0.028612574 hartree
energy: -1466.661409504182
dipole: 51.12008 -48.72153 2.39855 26.11406 -25.65254 0.46152 16.20248 -15.84544 0.35704
magnitude: 2.46851 au
magnitude: 6.27445 debye
