program: Orca
programVersion: 5.0.2
elementType: F F F O O O O O N C C C C C C C C C C C C C C C C C C C H H H H H H H H H H H H H H H H H H H H
charge: 0
multiplicity: 1
keywords: wb97x-d3
keywords: def2-TZVPP
keywords: def2/J RIJCOSX
keywords: DEFGRID2
keywords: scfconv7
keywords: smallprint printgap noloewdin
keywords: NOSOSCF
formula: C19H20F3NO5
InChI: InChI=1/C19H20F3NO5/c1-27-6-7-28-9-13-12(4-5-14(23-13)19(20,21)22)18(26)15-16(24)10-2-3-11(8-10)17(15)25/h4-5,10-11,24H,2-3,6-9H2,1H3
48 atoms
F  -5.386321 -1.037831 -1.537962
F  -4.895397 -2.916408 -0.606456
F  -5.151044 -1.148415 0.597824
O  3.245261 0.781801 -2.187171
O  0.808674 -1.360572 1.218493
O  0.818244 0.6494 -2.450855
O  -0.26866 2.311037 -0.232436
O  1.262676 2.708472 2.963116
N  -2.942717 0.021728 -0.666728
C  4.381295 -0.193258 -0.35493
C  3.182877 -1.280763 1.339797
C  4.251917 -1.569284 0.291879
C  4.473788 0.750349 0.868186
C  3.684284 0.031591 1.981894
C  3.118775 0.095588 -1.098531
C  1.840457 -1.03079 0.675058
C  1.886783 -0.327465 -0.6148
C  0.716442 0.008345 -1.399265
C  -0.64847 -0.466677 -1.038931
C  -1.69819 0.431716 -0.831992
C  -0.938583 -1.819656 -1.053422
C  -1.488908 1.926519 -0.790845
C  -2.24677 -2.243703 -0.894568
C  -3.211467 -1.27052 -0.713975
C  -4.673155 -1.598048 -0.561143
C  -0.192912 2.18677 1.169254
C  1.057397 2.930015 1.596391
C  2.341007 3.432932 3.477297
H  5.229212 -0.08579 -1.032006
H  3.051454 -2.074631 2.074765
H  3.978637 -2.355645 -0.414055
H  5.192966 -1.85884 0.764756
H  5.522384 0.872554 1.141713
H  4.091393 1.74775 0.648275
H  2.867078 0.629037 2.386889
H  4.338549 -0.208322 2.820874
H  -0.151643 -2.546783 -1.203742
H  -1.502806 2.315243 -1.81223
H  -2.342882 2.367206 -0.261529
H  -2.491554 -3.295111 -0.913038
H  -0.139195 1.137835 1.484826
H  -1.075623 2.626759 1.65266
H  1.912635 2.573378 1.001201
H  0.94346 4.00181 1.376511
H  2.199751 4.516642 3.375288
H  2.428943 3.196911 4.536961
H  3.289933 3.173723 2.987478
H  2.302844 0.91571 -2.547297
totalener: -1466.63485010 hartree
nucrepener: 2864.39864830 hartree
electener: -4331.03349840 hartree
oneelecener: -7706.86839134 hartree
twoeener: 3375.83489294 hartree
kineticenergy: 1460.92101812 hartree
xcener: -133.546600069215 hartree
chargesum: 0.0000000
charge: -0.162402 -0.177663 -0.160327 -0.277341 -0.351007 -0.372032 -0.326780 -0.322796 -0.293541 0.238568 0.279413 -0.282769 -0.269162 -0.264282 0.145885 0.086763 -0.262717 0.309615 0.056102 0.079387 -0.101428 0.011867 -0.110973 0.060799 0.496418 0.002036 -0.004012 -0.112442 0.088276 0.082451 0.090726 0.090695 0.098462 0.099943 0.107431 0.100308 0.121636 0.105876 0.103787 0.131711 0.108415 0.091784 0.054815 0.094558 0.090700 0.115533 0.064629 0.243088
qa: -0.1624 -0.1777 -0.1603 -0.2773 -0.3510 -0.3720 -0.3268 -0.3228 -0.2935 0.2386 0.2794 -0.2828 -0.2692 -0.2643 0.1459 0.0868 -0.2627 0.3096 0.0561 0.0794 -0.1014 0.0119 -0.1110 0.0608 0.4964 0.0020 -0.0040 -0.1124 0.0883 0.0825 0.0907 0.0907 0.0985 0.0999 0.1074 0.1003 0.1216 0.1059 0.1038 0.1317 0.1084 0.0918 0.0548 0.0946 0.0907 0.1155 0.0646 0.2431
va: 1.1438 1.1233 1.1479 2.2861 2.1101 2.1483 1.9681 1.9601 3.1204 3.6535 3.5737 4.0563 3.9460 3.8961 3.9966 4.0720 3.2818 3.8808 3.5665 3.9043 4.0115 3.8794 3.9628 3.9765 4.5145 3.8816 3.9368 3.9312 1.0210 1.0245 1.0172 1.0103 1.0108 1.0092 1.0342 1.0075 1.0070 1.0023 1.0156 1.0125 0.9994 1.0092 0.9879 1.0081 0.9948 0.9933 0.9852 1.1039
dispcorr: -0.028502788 hartree
energy: -1466.663352889696
dipole: 51.98159 -49.12238 2.85922 21.26027 -21.26065 -0.00038 18.64944 -18.32543 0.32401
magnitude: 2.87752 au
magnitude: 7.31407 debye
