program: Orca
programVersion: 5.0.2
elementType: F F F O O O O O N C C C C C C C C C C C C C C C C C C C H H H H H H H H H H H H H H H H H H H H
charge: 0
multiplicity: 1
keywords: wb97x-d3
keywords: def2-TZVPP
keywords: def2/J RIJCOSX
keywords: DEFGRID2
keywords: scfconv7
keywords: smallprint printgap noloewdin
keywords: NOSOSCF
formula: C19H20F3NO5
InChI: InChI=1/C19H20F3NO5/c1-27-6-7-28-9-13-12(4-5-14(23-13)19(20,21)22)18(26)15-16(24)10-2-3-11(8-10)17(15)25/h4-5,10-11,24H,2-3,6-9H2,1H3
48 atoms
F  -5.215139 -2.430476 -1.199707
F  -4.370951 -3.194691 0.628843
F  -5.318347 -1.26573 0.608921
O  2.951915 1.508489 -1.789373
O  0.991587 -2.098956 0.505484
O  0.503613 1.289504 -1.860012
O  0.252116 1.078924 1.48774
O  0.724595 4.623522 0.949541
N  -2.584416 -0.923939 0.605317
C  4.307396 0.051184 -0.510311
C  3.323514 -1.664579 0.752785
C  4.349292 -1.465572 -0.360496
C  4.417185 0.529785 0.955201
C  3.6911 -0.557963 1.772452
C  2.966204 0.456018 -1.028691
C  1.934807 -1.399342 0.208336
C  1.816418 -0.223659 -0.662013
C  0.547454 0.301055 -1.113965
C  -0.766214 -0.34478 -0.810859
C  -1.390328 -0.386149 0.441037
C  -1.466286 -0.850198 -1.894762
C  -0.768454 0.148893 1.704823
C  -2.709367 -1.434084 -1.711799
C  -3.216647 -1.451017 -0.4275
C  -4.543014 -2.08731 -0.094334
C  -0.193132 2.398608 1.267652
C  1.044142 3.283682 1.192183
C  0.503675 4.926531 -0.401093
H  5.086915 0.466858 -1.149583
H  3.335343 -2.660982 1.193526
H  4.107523 -2.001714 -1.280063
H  5.34231 -1.788704 -0.039996
H  5.472496 0.589131 1.225214
H  3.997802 1.525223 1.103751
H  2.811293 -0.167476 2.284558
H  4.346031 -0.969802 2.54047
H  -1.035308 -0.804523 -2.886353
H  -1.57034 0.556799 2.332488
H  -0.334624 -0.692857 2.249911
H  -3.251854 -1.847208 -2.549009
H  -0.837358 2.734254 2.091046
H  -0.783603 2.471965 0.344693
H  1.569686 3.243614 2.149628
H  1.730689 2.890716 0.42806
H  0.316375 5.997267 -0.470237
H  1.377382 4.69043 -1.021941
H  -0.358198 4.402706 -0.829629
H  1.980784 1.676815 -2.01547
totalener: -1466.63384906 hartree
nucrepener: 2876.14711789 hartree
electener: -4342.78096695 hartree
oneelecener: -7730.23029426 hartree
twoeener: 3387.44932731 hartree
kineticenergy: 1460.89983487 hartree
xcener: -133.544826701320 hartree
chargesum: -0.0000000
charge: -0.177663 -0.161971 -0.159381 -0.284451 -0.356638 -0.388795 -0.335859 -0.329490 -0.303065 0.226367 0.227630 -0.282660 -0.224950 -0.223377 0.083883 0.126936 -0.153928 0.238556 0.093667 0.108522 -0.107976 -0.006111 -0.144845 0.074879 0.496000 -0.029946 0.052206 -0.106962 0.086726 0.081420 0.094049 0.090205 0.096037 0.094075 0.090843 0.094404 0.122967 0.110198 0.115141 0.132063 0.099125 0.093645 0.093358 0.037561 0.113360 0.074874 0.084402 0.244970
qa: -0.1777 -0.1620 -0.1594 -0.2845 -0.3566 -0.3888 -0.3359 -0.3295 -0.3031 0.2264 0.2276 -0.2827 -0.2250 -0.2234 0.0839 0.1269 -0.1539 0.2386 0.0937 0.1085 -0.1080 -0.0061 -0.1448 0.0749 0.4960 -0.0299 0.0522 -0.1070 0.0867 0.0814 0.0940 0.0902 0.0960 0.0941 0.0908 0.0944 0.1230 0.1102 0.1151 0.1321 0.0991 0.0936 0.0934 0.0376 0.1134 0.0749 0.0844 0.2450
va: 1.1228 1.1426 1.1497 2.2685 2.1262 2.1071 1.9424 1.9971 3.1217 3.6771 3.5967 4.0622 3.9360 3.9217 4.0098 4.0611 3.3182 3.8826 3.5003 3.8540 4.0504 3.8807 3.9673 3.9694 4.5134 3.8553 3.9748 3.9428 1.0202 1.0236 1.0159 1.0106 1.0089 1.0196 1.0302 1.0084 1.0150 1.0145 1.0023 1.0136 1.0101 0.9914 0.9992 1.0178 0.9941 0.9943 0.9808 1.0951
dispcorr: -0.028954001 hartree
energy: -1466.662803061765
dipole: 46.43447 -44.19746 2.23701 26.26247 -25.93174 0.33073 5.50818 -6.13266 -0.62448
magnitude: 2.34597 au
magnitude: 5.96298 debye
