program: Orca
programVersion: 5.0.2
elementType: F F F O O O O O N C C C C C C C C C C C C C C C C C C C H H H H H H H H H H H H H H H H H H H H
charge: 0
multiplicity: 1
keywords: wb97x-d3
keywords: def2-TZVPP
keywords: def2/J RIJCOSX
keywords: DEFGRID2
keywords: scfconv7
keywords: smallprint printgap noloewdin
keywords: NOSOSCF
formula: C19H20F3NO5
InChI: InChI=1/C19H20F3NO5/c1-27-6-7-28-9-13-12(4-5-14(23-13)19(20,21)22)18(26)15-16(24)10-2-3-11(8-10)17(15)25/h4-5,10-11,24H,2-3,6-9H2,1H3
48 atoms
F  -5.513936 -0.843282 0.042589
F  -5.087499 -2.699323 -0.964146
F  -4.621991 -2.469506 1.126562
O  3.001348 1.405208 -1.858875
O  0.906513 -2.000953 0.613962
O  0.55103 1.166716 -2.048818
O  0.188164 1.348742 1.369839
O  1.83042 3.330524 0.195579
N  -2.632296 -0.707291 0.583276
C  4.270624 0.085663 -0.362048
C  3.228615 -1.569826 0.933448
C  4.3127 -1.421237 -0.130539
C  4.27899 0.648172 1.078525
C  3.553064 -0.422069 1.918536
C  2.964502 0.441876 -0.993608
C  1.866819 -1.323093 0.314951
C  1.795249 -0.209241 -0.632827
C  0.554718 0.275538 -1.191503
C  -0.78082 -0.306612 -0.851349
C  -1.421054 -0.218165 0.389809
C  -1.480423 -0.893102 -1.894341
C  -0.806621 0.400794 1.619464
C  -2.737427 -1.43369 -1.676174
C  -3.261295 -1.319011 -0.403286
C  -4.629613 -1.841325 -0.044488
C  -0.29549 2.616938 1.001094
C  0.816999 3.628897 1.110905
C  2.84985 4.286892 0.177313
H  5.087893 0.472794 -0.971519
H  3.213198 -2.546027 1.417467
H  4.125493 -2.006111 -1.03301
H  5.287829 -1.718573 0.262083
H  5.312797 0.774156 1.403256
H  3.797418 1.6228 1.140778
H  2.656766 -0.027653 2.397527
H  4.198181 -0.797398 2.713544
H  -1.035521 -0.947312 -2.879254
H  -1.623109 0.813254 2.226389
H  -0.349319 -0.400191 2.205133
H  -3.277388 -1.914817 -2.478325
H  -1.106582 2.933361 1.672427
H  -0.702517 2.617362 -0.018335
H  0.387921 4.624065 0.917349
H  1.203436 3.643806 2.141318
H  3.585429 3.974664 -0.562167
H  2.478683 5.281743 -0.102112
H  3.352796 4.380512 1.149092
H  2.045236 1.57197 -2.136502
totalener: -1466.63667561 hartree
nucrepener: 2904.74796926 hartree
electener: -4371.38464486 hartree
oneelecener: -7788.38154441 hartree
twoeener: 3416.99689955 hartree
kineticenergy: 1460.91153823 hartree
xcener: -133.545293704511 hartree
chargesum: 0.0000000
charge: -0.167363 -0.177363 -0.157052 -0.288660 -0.362858 -0.386274 -0.325103 -0.308851 -0.302591 0.210298 0.228881 -0.282702 -0.210068 -0.225492 0.130942 0.107249 -0.157225 0.239756 0.095435 0.114362 -0.098778 -0.017741 -0.150488 0.079856 0.494809 -0.003593 0.013829 -0.135439 0.083530 0.079990 0.092477 0.088278 0.093519 0.090101 0.090314 0.092936 0.122188 0.107385 0.113008 0.130827 0.090233 0.095634 0.068149 0.069020 0.103454 0.098614 0.086237 0.246331
qa: -0.1674 -0.1774 -0.1571 -0.2887 -0.3629 -0.3863 -0.3251 -0.3089 -0.3026 0.2103 0.2289 -0.2827 -0.2101 -0.2255 0.1309 0.1072 -0.1572 0.2398 0.0954 0.1144 -0.0988 -0.0177 -0.1505 0.0799 0.4948 -0.0036 0.0138 -0.1354 0.0835 0.0800 0.0925 0.0883 0.0935 0.0901 0.0903 0.0929 0.1222 0.1074 0.1130 0.1308 0.0902 0.0956 0.0681 0.0690 0.1035 0.0986 0.0862 0.2463
va: 1.1331 1.1232 1.1533 2.2693 2.1201 2.1125 1.9486 1.9747 3.1185 3.7106 3.5972 4.0723 3.9328 3.9390 3.9799 4.0872 3.3221 3.8720 3.5190 3.8301 4.0396 3.8606 3.9766 3.9573 4.5140 3.9156 3.9716 3.9217 1.0200 1.0241 1.0165 1.0103 1.0080 1.0264 1.0264 1.0071 1.0160 1.0173 1.0014 1.0135 1.0037 1.0040 0.9961 1.0003 0.9993 0.9989 0.9848 1.0956
dispcorr: -0.029397891 hartree
energy: -1466.666073497604
dipole: 50.53215 -48.22800 2.30414 26.63281 -25.45287 1.17994 8.73506 -8.73937 -0.00432
magnitude: 2.58870 au
magnitude: 6.57995 debye
