program: Orca
programVersion: 5.0.2
elementType: F F F O O O O O N C C C C C C C C C C C C C C C C C C C H H H H H H H H H H H H H H H H H H H H
charge: 0
multiplicity: 1
keywords: wb97x-d3
keywords: def2-TZVPP
keywords: def2/J RIJCOSX
keywords: DEFGRID2
keywords: scfconv7
keywords: smallprint printgap noloewdin
keywords: NOSOSCF
formula: C19H20F3NO5
InChI: InChI=1/C19H20F3NO5/c1-27-6-7-28-9-13-12(4-5-14(23-13)19(20,21)22)18(26)15-16(24)10-2-3-11(8-10)17(15)25/h4-5,10-11,26H,2-3,6-9H2,1H3
48 atoms
F  4.836658 2.897339 0.418169
F  5.317901 1.257899 1.72764
F  5.265731 0.953965 -0.401668
O  -0.882961 1.467928 -1.184983
O  -3.158506 -1.034093 2.078731
O  -0.743539 -0.941087 2.246749
O  0.373913 -2.307091 -0.208977
O  -1.780591 -2.573275 -2.086238
N  2.954819 -0.069261 0.590323
C  -3.261703 1.449139 -1.153331
C  -4.406659 0.203183 0.479146
C  -4.251831 1.640553 -0.007864
C  -3.837197 0.227838 -1.904551
C  -4.590905 -0.588231 -0.83481
C  -1.887705 1.102662 -0.611984
C  -3.126878 -0.23944 1.130434
C  -1.878279 0.272335 0.601485
C  -0.712766 -0.126142 1.243504
C  0.648922 0.375741 0.956881
C  1.711816 -0.500741 0.713834
C  0.927279 1.72857 1.05813
C  1.5076 -1.987204 0.540399
C  2.232121 2.172462 0.933291
C  3.210042 1.22082 0.70765
C  4.670561 1.584025 0.605665
C  0.472218 -1.954915 -1.570392
C  -0.439049 -2.834914 -2.387526
C  -2.655691 -3.455657 -2.725818
H  -3.156426 2.31864 -1.802283
H  -5.225741 0.044799 1.180963
H  -3.904053 2.328626 0.765855
H  -5.204828 2.022792 -0.380908
H  -4.519823 0.574582 -2.681365
H  -3.060285 -0.355063 -2.39689
H  -4.22101 -1.609864 -0.748556
H  -5.65541 -0.654219 -1.063149
H  0.132367 2.436441 1.248952
H  2.425265 -2.389705 0.092588
H  1.385975 -2.4601 1.517471
H  2.464347 3.22422 1.009947
H  1.495474 -2.111028 -1.94016
H  0.23228 -0.896988 -1.729453
H  -0.231102 -2.64796 -3.452374
H  -0.19038 -3.888903 -2.193633
H  -3.673311 -3.184005 -2.446722
H  -2.57633 -3.405394 -3.8198
H  -2.484565 -4.496948 -2.424423
H  -1.728724 -1.198779 2.381136
totalener: -1466.63491588 hartree
nucrepener: 2873.47048821 hartree
electener: -4340.10540409 hartree
oneelecener: -7725.37136445 hartree
twoeener: 3385.26596036 hartree
kineticenergy: 1460.91936525 hartree
xcener: -133.546020765765 hartree
chargesum: -0.0000000
charge: -0.175530 -0.164862 -0.156296 -0.366581 -0.376166 -0.286824 -0.315387 -0.312161 -0.287148 0.242940 0.208905 -0.272758 -0.239462 -0.248207 0.102155 0.146793 -0.219273 0.317829 0.027634 0.083920 -0.096756 0.011721 -0.112580 0.068353 0.495389 -0.004674 0.023907 -0.108243 0.079604 0.080911 0.086718 0.086554 0.094113 0.095476 0.098778 0.094655 0.127498 0.100783 0.106689 0.132475 0.087948 0.103282 0.062413 0.065847 0.084406 0.087904 0.096212 0.241095
qa: -0.1755 -0.1649 -0.1563 -0.3666 -0.3762 -0.2868 -0.3154 -0.3122 -0.2871 0.2429 0.2089 -0.2728 -0.2395 -0.2482 0.1022 0.1468 -0.2193 0.3178 0.0276 0.0839 -0.0968 0.0117 -0.1126 0.0684 0.4954 -0.0047 0.0239 -0.1082 0.0796 0.0809 0.0867 0.0866 0.0941 0.0955 0.0988 0.0947 0.1275 0.1008 0.1067 0.1325 0.0879 0.1033 0.0624 0.0658 0.0844 0.0879 0.0962 0.2411
va: 1.1255 1.1372 1.1547 2.0987 2.1514 2.2709 1.9684 1.9819 3.1027 3.6249 3.7107 4.0382 3.8954 3.9397 4.0738 4.0796 3.2855 3.8383 3.5975 3.8612 3.9933 3.8696 3.9762 3.9689 4.5103 3.9234 3.9783 3.9285 1.0260 1.0272 1.0170 1.0095 1.0065 1.0441 1.0141 1.0068 1.0054 1.0136 1.0034 1.0129 1.0034 0.9971 0.9944 1.0007 0.9956 0.9888 0.9948 1.1111
dispcorr: -0.027903956 hartree
energy: -1466.662819836308
dipole: -50.09429 48.17265 -1.92164 -20.02743 20.02759 0.00015 -19.68405 18.98419 -0.69985
magnitude: 2.04512 au
magnitude: 5.19827 debye
