program: Gaussian 09
title: 000059387
version: EM64L-G09RevD.01
frameworkgroup: C1[X(C14H15ClN2O2)]
method: RPBEPBE
basis: SDD
operation: Freq
keyword: #p
keyword: freq=noraman
keyword: PBEPBE/SDD
title: #p freq=noraman PBEPBE/SDD
converged: YES YES NO NO
title: Mulliken charges:
elementType: Cl O O N N C C C C C C C C C C C C C C H H H H H H H H H H H H H H H
charge: -0.065425 -0.242060 -0.244862 -0.313046 -0.459115 -0.468468 -0.430582 0.446175 0.373252 0.182826 0.309745 -0.302718 -0.398720 -0.815385 -0.404437 -0.246992 -0.226144 -0.261575 -0.181553 0.213224 0.224640 0.213388 0.227374 0.308789 0.308723 0.237749 0.221215 0.221908 0.292906 0.278526 0.258857 0.235598 0.250422 0.255766
chargesum: 0.00000
title: Mulliken charges with hydrogens summed into heavy atoms:
elementType: Cl O O N N C C C C C C C C C C C C C C
charge: -0.065425 -0.242060 -0.244862 -0.004257 -0.150392 -0.030604 0.010179 0.446175 0.373252 0.182826 0.309745 -0.302718 -0.160971 -0.079356 -0.125911 0.011865 0.009453 -0.011153 0.074213
polarizability: 2.43568267e+02 3.54917101e+00 1.65087631e+02 1.36632083e+01 1.15451217e+00 1.28106752e+02
1716.lowfreq: -3.4141 0.0024 0.0027 0.0028 0.6553 4.0621 15.8658 30.1316 32.3038
frequency: 15.7147 30.0982 32.2298 56.7428 71.4609 84.5547 106.6964 131.9753 144.2627 164.3001 187.2419 205.9547 224.3404 248.5699 268.6646 300.1857 315.8939 339.9670 382.6981 432.3805 461.9633 510.0939 512.3232 539.3993 573.9289 592.5262 611.6590 616.4598 643.3140 680.8829 700.7281 715.7638 720.0691 756.5448 772.9378 806.4182 824.7551 857.6122 869.4719 879.9962 894.8688 901.7367 941.4832 965.7680 970.7507 988.3727 995.1380 1007.4135 1040.3349 1052.1480 1081.3559 1093.8333 1129.6562 1138.3651 1155.3524 1167.8770 1184.1708 1192.2150 1206.3632 1215.7703 1237.4371 1242.4804 1281.8275 1311.7084 1351.4269 1366.0540 1392.4957 1398.1009 1417.3708 1450.6928 1456.1997 1466.0862 1466.9374 1479.2737 1485.9055 1493.7383 1496.9058 1573.4423 1596.2983 1608.8102 1637.3316 2826.8964 2861.0611 2961.4026 2962.8513 2982.5544 3064.7549 3093.1459 3136.6871 3158.1624 3180.5769 3220.4941 3242.8597 3268.1732 3447.8496 3494.1802
redmass: 6.4347 4.6256 5.5683 4.5563 5.0388 6.7511 3.3843 2.9186 4.3350 2.7595 1.4641 4.6069 3.1356 4.8193 4.0927 4.7833 3.2462 5.2509 7.5648 5.2444 3.6510 4.2792 3.7410 4.3218 2.9782 3.4154 2.6632 1.7970 5.2073 1.3968 4.0023 3.7688 1.2865 4.0141 1.2806 5.5453 1.2343 4.5055 6.3112 1.3531 1.3465 3.7006 4.8531 1.7755 1.3392 1.9310 1.6234 1.7785 2.6875 1.5376 1.9560 2.4147 1.5313 2.4223 1.8107 2.0844 1.4718 2.2517 1.6816 1.6348 1.4579 2.0606 2.0084 1.5247 2.1502 6.7685 1.7257 1.2288 2.1931 1.3031 1.1374 2.3452 1.2130 1.1798 1.2978 2.9235 1.8260 5.6992 6.7781 6.9612 5.3595 1.0710 1.0707 1.0853 1.0856 1.0364 1.0970 1.0999 1.0877 1.0931 1.0980 1.0914 1.0993 1.1083 1.0748 1.0757
irintensity: 0.1554 0.1572 0.3658 1.1269 1.2904 3.7373 7.4787 1.7771 3.5628 0.9354 2.0120 3.1549 2.6303 1.6524 10.8288 7.8958 0.3127 1.6033 19.0939 14.5150 1.9343 1.5815 1.4967 6.1182 13.4919 6.7181 3.9631 69.7390 7.3087 74.7040 22.4700 29.6476 82.3440 11.9977 61.9558 14.6229 36.6634 22.4674 3.8356 2.4972 0.1749 20.7063 26.7414 17.9256 0.3887 6.1188 9.7506 10.9300 0.8907 8.4969 6.7965 3.2970 6.2196 10.1741 23.8293 77.8588 10.7586 6.1487 53.5882 5.0222 5.5025 35.0831 57.4907 13.0514 4.1899 81.2017 15.7903 28.6174 44.5484 203.0204 62.3664 43.7916 4.7738 24.8524 10.6632 9.3231 244.4478 16.2098 7.5396 12.9698 100.6590 93.0501 92.0882 42.1206 36.5839 20.6608 9.4569 19.3045 6.1357 14.4411 7.5229 4.9746 0.3834 0.7868 21.6958 30.7546
temp: 298.150 k
press: 1.00000 atm
elementType: 17 8 8 7 7 6 6 6 6 6 6 6 6 6 6 6 6 6 6 1 1 1 1 1 1 1 1 1 1 1 1 1 1 1
symmnumber: 1
zpe: 692792.9 jmol-1
zpe.correction: 0.263871 hartree
zpe.thermalcorrener: 0.282190 hartree
zpe.thermalcorrenthalpy: 0.283134 hartree
zpe.thermalcorrgfe: 0.214345 hartree
zpe.sumelectzpe: -1261.090859 hartree
zpe.sumelectthermal: -1261.072539 hartree
zpe.sumelectthermalent: -1261.071595 hartree
zpe.sumelectthermalfe: -1261.140384 hartree
dipole: 2.1580 -0.3922 -1.9035
dipole: 2.9041
quadrupole: -103.5432 -118.2647 -115.7047
quadrupole: -4.4294 -0.5685 1.0587
quadrupole: 8.9610 -5.7605 -3.2005 -4.4294 -0.5685 1.0587
hfenergy: -1261.3547294 hartree
pointgroup: C01 [X(C14H15Cl1N2O2)]
dipole: -0.8602575 -0.2606658 0.7053159 debye
polarizability: 242.8390922|-10.2503486|164.8448538|12.4494478|5.7407745|129.0787047 unknown
InChI: InChI=1S/C14H15ClN2O2/c1-10-4-2-6-12(15)14(10)17-13(18)9-16-8-11-5-3-7-19-11/h2-7,16-17H,8-9H2,1H3
charge 0 multiplicity 1
34 atoms
Cl -3.022871 2.804399 0.872354
O  5.639883 -0.686017 0.594465
O  -0.322022 -0.93135 -0.733837
N  2.007346 -0.038327 0.456014
N  -1.62046 0.138049 0.907915
C  0.801283 -0.101962 1.28012
C  3.271353 -0.24671 1.178331
C  -2.908478 0.057241 0.295631
C  -3.46146 -1.174812 -0.172066
C  -0.420735 -0.333013 0.375412
C  4.436354 -0.02463 0.257191
C  -3.699805 1.232962 0.205867
C  -4.749054 -1.14859 -0.765886
C  -2.730719 -2.489492 -0.005577
C  4.624498 0.715984 -0.897542
C  -4.982268 1.251265 -0.361198
C  -5.501909 0.039578 -0.869623
C  6.001833 0.521477 -1.311541
C  6.586221 -0.324992 -0.387415
H  0.814939 -0.945449 2.020818
H  0.678828 0.830632 1.870328
H  3.36863 -1.262631 1.638025
H  3.312261 0.475611 2.020746
H  1.908651 -0.607995 -0.395882
H  -1.538603 0.811344 1.676545
H  -5.171225 -2.08995 -1.134396
H  -2.269569 -2.567418 0.996518
H  -3.423259 -3.337756 -0.13671
H  -1.909343 -2.576179 -0.739215
H  3.86523 1.324959 -1.382184
H  -5.551119 2.183325 -0.412031
H  -6.495936 0.027099 -1.327882
H  6.488467 0.956183 -2.182559
H  7.575958 -0.755537 -0.265637
