program: Orca
programVersion: 5.0.2
elementType: Cl Cl O O O N N C C C C C C C C C C C C C C C C C C C C C C H H H H H H H H H H H H H H H H H H H H
charge: 0
multiplicity: 1
keywords: wb97x-d3
keywords: def2-TZVPP
keywords: def2/J RIJCOSX
keywords: DEFGRID2
keywords: scfconv7
keywords: smallprint printgap noloewdin
keywords: NOSOSCF
formula: C22H20Cl2N2O3
InChI: InChI=1/C22H20Cl2N2O3/c1-12-5-7-15(8-6-12)18(27)11-29-22-19(14(3)25-26(22)4)21(28)16-9-10-17(23)13(2)20(16)24/h5-10H,11H2,1-4H3
49 atoms
Cl 0.490841 2.521303 -2.264045
Cl -4.256608 0.067457 -1.422888
O  1.899443 -0.539176 -1.311436
O  0.930797 2.828324 1.579399
O  1.916049 -1.694705 1.167546
N  3.891253 0.294656 -0.662856
N  4.492731 1.268924 0.047979
C  2.25091 1.42634 0.264342
C  2.563368 0.340952 -0.567833
C  3.531699 1.944287 0.623744
C  0.99448 1.98685 0.693582
C  -0.296821 1.521785 0.099392
C  3.858078 3.103121 1.494347
C  0.786054 -1.297773 -0.879683
C  4.667299 -0.677535 -1.398181
C  -0.642657 1.70501 -1.236248
C  -1.863497 1.274649 -1.760458
C  -1.216899 0.938155 0.960146
C  0.877745 -1.789131 0.546201
C  -0.350563 -2.357056 1.136358
C  -2.731959 0.656609 -0.85575
C  -2.434863 0.493006 0.485035
C  -2.254111 1.438929 -3.194638
C  -1.442582 -2.738422 0.355877
C  -0.440466 -2.473423 2.52363
C  -2.695116 -3.32712 2.338181
C  -2.592972 -3.223589 0.951538
C  -1.600831 -2.940766 3.112562
C  -3.938887 -3.859894 2.977441
H  3.367976 4.015002 1.15413
H  3.548048 2.933272 2.525045
H  4.933683 3.274454 1.4893
H  -0.142548 -0.753279 -1.042987
H  0.755723 -2.166979 -1.542583
H  4.512273 -0.580281 -2.471385
H  5.71502 -0.500737 -1.17864
H  4.410142 -1.688754 -1.087759
H  -0.970285 0.803564 2.004871
H  -3.139787 0.016966 1.152057
H  -1.460979 1.874043 -3.793891
H  -2.510492 0.475922 -3.636492
H  -3.130983 2.080778 -3.288027
H  -1.411687 -2.665852 -0.723699
H  0.389242 -2.172909 3.149816
H  -3.429452 -3.517804 0.329877
H  -1.661636 -3.002937 4.192037
H  -4.075896 -3.461106 3.98186
H  -4.825072 -3.623009 2.389421
H  -3.889975 -4.947904 3.064478
elementType: Cl O N C H
totalener: -2106.08092930 hartree
nucrepener: 3225.52879004 hartree
electener: -5331.60971935 hartree
oneelecener: -9302.00265497 hartree
twoeener: 3970.39293562 hartree
cpcmener: -0.04572982 hartree
kineticenergy: 2099.70636649 hartree
xcener: -157.007781343696 hartree
chargesum: 0.0000000
charge: -0.069730 -0.075996 -0.346841 -0.479528 -0.440151 0.139770 -0.344591 -0.230941 0.249672 0.080392 0.405350 0.055803 -0.260331 0.082227 -0.163068 0.012851 -0.018628 -0.132083 0.349746 -0.017101 0.121897 -0.232903 -0.241491 -0.161290 -0.150872 0.022714 -0.183024 -0.160159 -0.202012 0.101295 0.100137 0.095537 0.088313 0.163406 0.121956 0.112275 0.117952 0.150481 0.144405 0.087451 0.107698 0.116474 0.145337 0.142599 0.142485 0.146577 0.098536 0.099161 0.108244
qa: -0.0697 -0.0760 -0.3468 -0.4795 -0.4402 0.1398 -0.3446 -0.2309 0.2497 0.0804 0.4053 0.0558 -0.2603 0.0822 -0.1631 0.0129 -0.0186 -0.1321 0.3497 -0.0171 0.1219 -0.2329 -0.2415 -0.1613 -0.1509 0.0227 -0.1830 -0.1602 -0.2020 0.1013 0.1001 0.0955 0.0883 0.1634 0.1220 0.1123 0.1180 0.1505 0.1444 0.0875 0.1077 0.1165 0.1453 0.1426 0.1425 0.1466 0.0985 0.0992 0.1082
va: 1.2707 1.2553 2.0894 2.0101 2.0239 3.2973 2.9374 3.4629 4.0711 4.0000 3.8498 3.4249 3.9554 3.8376 3.8900 3.8235 3.6929 3.9558 3.8261 3.5862 3.7740 3.9961 3.9321 3.9164 3.9589 3.7178 3.9055 3.9390 3.9000 0.9978 1.0001 1.0163 1.0068 0.9905 0.9881 1.0104 0.9966 1.0058 1.0092 1.0225 0.9994 0.9959 1.0008 1.0228 1.0042 0.9995 1.0024 1.0010 0.9942
dispcorr: -0.032761046 hartree
energy: -2106.113690350115
dipole: 2.44925 -5.05618 -2.60693 -16.78943 13.64388 -3.14555 11.42772 -12.85597 -1.42825
magnitude: 4.32787 au
magnitude: 11.00057 debye
