program: Orca
programVersion: 5.0.2
elementType: Cl Cl O O O N N C C C C C C C C C C C C C C C C C C C C C C H H H H H H H H H H H H H H H H H H H H
charge: 0
multiplicity: 1
keywords: wb97x-d3
keywords: def2-TZVPP
keywords: def2/J RIJCOSX
keywords: DEFGRID2
keywords: scfconv7
keywords: smallprint printgap noloewdin
keywords: NOSOSCF
formula: C22H20Cl2N2O3
InChI: InChI=1/C22H20Cl2N2O3/c1-12-5-7-15(8-6-12)18(27)11-29-22-19(14(3)25-26(22)4)21(28)16-9-10-17(23)13(2)20(16)24/h5-10H,11H2,1-4H3
49 atoms
Cl 0.365844 2.652767 -2.187227
Cl -4.259285 0.071274 -1.070597
O  1.837544 -0.464095 -1.413442
O  1.115663 2.887628 1.571788
O  1.857328 -1.671958 1.047552
N  3.884438 0.254184 -0.802551
N  4.553133 1.179847 -0.086415
C  2.329333 1.429823 0.21164
C  2.563997 0.354478 -0.659567
C  3.643564 1.881967 0.538341
C  1.114263 2.024298 0.7045
C  -0.216223 1.56474 0.199974
C  4.051989 2.993787 1.435291
C  0.722874 -1.223597 -0.986635
C  4.590879 -0.714063 -1.610215
C  -0.667964 1.798045 -1.090909
C  -1.920886 1.376993 -1.546421
C  -1.064326 0.932303 1.100465
C  0.822599 -1.764199 0.419958
C  -0.398077 -2.373264 0.986193
C  -2.710346 0.699379 -0.614706
C  -2.306179 0.488751 0.694375
C  -2.344926 1.640456 -2.955787
C  -0.472268 -2.577539 2.36379
C  -1.503982 -2.696186 0.197899
C  -2.738296 -3.396454 2.155415
C  -1.6295 -3.072579 2.93726
C  -2.652574 -3.204828 0.776586
C  -3.982008 -3.953845 2.774134
H  3.610802 3.942877 1.131028
H  3.749397 2.811386 2.466421
H  5.135604 3.102685 1.415779
H  -0.200984 -0.662514 -1.118533
H  0.670544 -2.069322 -1.677891
H  5.651661 -0.601827 -1.411545
H  4.29111 -1.726562 -1.347901
H  4.413252 -0.549974 -2.67165
H  -0.740488 0.75555 2.117663
H  -2.950258 -0.030538 1.390333
H  -1.663533 1.165812 -3.662763
H  -3.343659 1.26776 -3.16044
H  -2.341491 2.709414 -3.170175
H  0.36704 -2.324488 2.998193
H  -1.488288 -2.553901 -0.875021
H  -1.676456 -3.203732 4.011344
H  -3.500704 -3.447241 0.148354
H  -4.067854 -3.675127 3.823583
H  -4.875801 -3.611161 2.253321
H  -3.980122 -5.045061 2.726104
elementType: Cl O N C H
totalener: -2106.08059410 hartree
nucrepener: 3233.06127394 hartree
electener: -5339.14186804 hartree
oneelecener: -9317.03581127 hartree
twoeener: 3977.89394323 hartree
cpcmener: -0.04554057 hartree
kineticenergy: 2099.70421248 hartree
xcener: -157.008458719866 hartree
chargesum: 0.0000000
charge: -0.068070 -0.079450 -0.347756 -0.480574 -0.440106 0.139166 -0.343822 -0.227824 0.254199 0.078176 0.404210 0.064295 -0.260632 0.074661 -0.164148 -0.020405 -0.033549 -0.150273 0.349772 -0.015783 0.155508 -0.213050 -0.236398 -0.149404 -0.158910 0.016465 -0.155905 -0.182320 -0.202207 0.100733 0.100983 0.095251 0.095624 0.163586 0.112397 0.118554 0.122447 0.152886 0.144204 0.112689 0.086090 0.110773 0.142109 0.143241 0.146540 0.140610 0.097219 0.100014 0.108185
qa: -0.0681 -0.0794 -0.3478 -0.4806 -0.4401 0.1392 -0.3438 -0.2278 0.2542 0.0782 0.4042 0.0643 -0.2606 0.0747 -0.1641 -0.0204 -0.0335 -0.1503 0.3498 -0.0158 0.1555 -0.2131 -0.2364 -0.1494 -0.1589 0.0165 -0.1559 -0.1823 -0.2022 0.1007 0.1010 0.0953 0.0956 0.1636 0.1124 0.1186 0.1224 0.1529 0.1442 0.1127 0.0861 0.1108 0.1421 0.1432 0.1465 0.1406 0.0972 0.1000 0.1082
va: 1.2788 1.2474 2.0896 2.0092 2.0250 3.2983 2.9363 3.4726 4.0715 4.0025 3.8470 3.4303 3.9575 3.8380 3.8903 3.8831 3.7194 3.9656 3.8301 3.5858 3.7163 3.9862 3.9338 3.9538 3.9143 3.7223 3.9353 3.9048 3.9011 0.9981 0.9994 1.0163 1.0018 0.9908 1.0102 0.9959 0.9880 1.0037 1.0068 0.9968 1.0231 0.9983 1.0238 1.0014 0.9994 1.0066 1.0032 1.0001 0.9944
dispcorr: -0.033244920 hartree
energy: -2106.113839017939
dipole: 2.70161 -5.32840 -2.62679 -17.32812 14.17300 -3.15512 9.69176 -11.17736 -1.48560
magnitude: 4.36598 au
magnitude: 11.09745 debye
