program: Orca
programVersion: 5.0.2
elementType: Cl Cl O O O N N C C C C C C C C C C C C C C C C C C C C C C H H H H H H H H H H H H H H H H H H H H
charge: 0
multiplicity: 1
keywords: wb97x-d3
keywords: def2-TZVPP
keywords: def2/J RIJCOSX
keywords: DEFGRID2
keywords: scfconv7
keywords: smallprint printgap noloewdin
keywords: NOSOSCF
formula: C22H20Cl2N2O3
InChI: InChI=1/C22H20Cl2N2O3/c1-12-5-7-15(8-6-12)18(27)11-29-22-19(14(3)25-26(22)4)21(28)16-9-10-17(23)13(2)20(16)24/h5-10H,11H2,1-4H3
49 atoms
Cl 0.561531 2.689976 -2.08837
Cl -4.267074 0.285383 -1.765808
O  1.80154 -0.495324 -1.357012
O  0.809321 2.518724 1.855382
O  1.999974 -1.854958 0.997196
N  3.801298 0.323288 -0.687455
N  4.397732 1.24232 0.097005
C  2.159323 1.337563 0.361888
C  2.47498 0.337962 -0.567066
C  3.434932 1.846541 0.745567
C  0.894086 1.830383 0.847744
C  -0.374056 1.486052 0.135758
C  3.74992 2.93758 1.703429
C  0.722582 -1.302518 -0.921159
C  4.580579 -0.578824 -1.503581
C  -0.628823 1.805745 -1.19243
C  -1.823727 1.474617 -1.838471
C  -1.370371 0.852575 0.87049
C  0.91198 -1.88923 0.46045
C  -0.277258 -2.465152 1.117283
C  -2.764838 0.790239 -1.067063
C  -2.558841 0.490455 0.270964
C  -2.04233 1.844729 -3.271118
C  -1.433485 -2.786867 0.408314
C  -0.258407 -2.656688 2.500916
C  -2.539931 -3.454191 2.451768
C  -2.54405 -3.284913 1.06951
C  -1.377319 -3.131864 3.155528
C  -3.745943 -3.963371 3.176354
H  4.817112 3.151747 1.68125
H  3.215429 3.855551 1.458921
H  3.481216 2.668407 2.724704
H  -0.220328 -0.764266 -0.993924
H  0.666129 -2.126129 -1.638243
H  4.410267 -0.402675 -2.5639
H  5.6285 -0.403811 -1.283741
H  4.341015 -1.614176 -1.268692
H  -1.201035 0.606775 1.910461
H  -3.316821 -0.030251 0.839051
H  -1.272381 1.409073 -3.908381
H  -3.005025 1.50606 -3.640868
H  -1.999791 2.926075 -3.404098
H  -1.485284 -2.660331 -0.66555
H  0.626387 -2.408166 3.072169
H  -3.431639 -3.535425 0.50223
H  -1.353263 -3.252417 4.231765
H  -4.577715 -4.143033 2.49747
H  -3.526275 -4.897857 3.694898
H  -4.076718 -3.251059 3.9336
elementType: Cl O N C H
totalener: -2106.08150378 hartree
nucrepener: 3213.86365764 hartree
electener: -5319.94516143 hartree
oneelecener: -9278.69240448 hartree
twoeener: 3958.74724306 hartree
cpcmener: -0.04549756 hartree
kineticenergy: 2099.70819271 hartree
xcener: -157.007006373038 hartree
chargesum: -0.0000000
charge: -0.067650 -0.077386 -0.346059 -0.477543 -0.440558 0.142155 -0.343488 -0.225160 0.236668 0.081797 0.393647 0.080841 -0.261689 0.085599 -0.162197 -0.039370 -0.022642 -0.127856 0.353634 -0.019617 0.164248 -0.234056 -0.231547 -0.161463 -0.142940 0.035001 -0.185217 -0.178954 -0.200948 0.095957 0.103283 0.099951 0.078978 0.163357 0.122466 0.112324 0.116671 0.145853 0.141385 0.111013 0.085561 0.109805 0.146809 0.142088 0.144418 0.146326 0.094302 0.106573 0.105631
qa: -0.0677 -0.0774 -0.3461 -0.4775 -0.4406 0.1422 -0.3435 -0.2252 0.2367 0.0818 0.3936 0.0808 -0.2617 0.0856 -0.1622 -0.0394 -0.0226 -0.1279 0.3536 -0.0196 0.1642 -0.2341 -0.2315 -0.1615 -0.1429 0.0350 -0.1852 -0.1790 -0.2009 0.0960 0.1033 0.1000 0.0790 0.1634 0.1225 0.1123 0.1167 0.1459 0.1414 0.1110 0.0856 0.1098 0.1468 0.1421 0.1444 0.1463 0.0943 0.1066 0.1056
va: 1.2764 1.2494 2.0833 2.0109 2.0228 3.2982 2.9385 3.4411 4.0827 4.0007 3.8594 3.3575 3.9538 3.8408 3.8888 3.8856 3.7214 3.9451 3.8247 3.5936 3.7404 4.0322 3.9302 3.9163 3.9587 3.7148 3.9076 3.9562 3.8983 1.0161 0.9970 1.0004 1.0119 0.9902 0.9879 1.0104 0.9979 1.0070 1.0117 0.9983 1.0228 0.9987 1.0015 1.0221 1.0029 0.9999 1.0058 0.9960 0.9964
dispcorr: -0.032101143 hartree
energy: -2106.113604925716
dipole: 3.05406 -5.61675 -2.56269 -17.07540 14.25746 -2.81794 12.17675 -13.69336 -1.51662
magnitude: 4.09979 au
magnitude: 10.42085 debye
