program: Orca
programVersion: 5.0.2
elementType: Cl Cl O O O N N C C C C C C C C C C C C C C C C C C C C C C H H H H H H H H H H H H H H H H H H H H
charge: 0
multiplicity: 1
keywords: wb97x-d3
keywords: def2-TZVPP
keywords: def2/J RIJCOSX
keywords: DEFGRID2
keywords: scfconv7
keywords: smallprint printgap noloewdin
keywords: NOSOSCF
formula: C22H20Cl2N2O3
InChI: InChI=1/C22H20Cl2N2O3/c1-12-5-7-15(8-6-12)18(27)11-29-22-19(14(3)25-26(22)4)21(28)16-9-10-17(23)13(2)20(16)24/h5-10H,11H2,1-4H3
49 atoms
Cl -0.263639 0.887688 -2.326266
Cl -3.975259 0.802922 1.590905
O  1.565621 -0.61195 -0.05726
O  1.607553 3.725475 -0.343204
O  0.125044 -0.750427 3.069808
N  3.610565 -0.247367 -1.116304
N  4.35312 0.753949 -1.625954
C  2.464034 1.586152 -0.734455
C  2.474037 0.203136 -0.587308
C  3.691282 1.863231 -1.394512
C  1.433037 2.516089 -0.346543
C  0.102328 1.992862 0.105801
C  4.236334 3.176877 -1.818972
C  1.709478 -0.872045 1.34393
C  4.0249 -1.621513 -1.284578
C  -0.755074 1.261713 -0.707086
C  -2.023281 0.842131 -0.299054
C  -0.32946 2.336439 1.380359
C  0.364795 -1.193581 1.96297
C  -0.601252 -2.052098 1.249374
C  -2.40522 1.22144 0.987722
C  -1.576459 1.947361 1.827961
C  -2.887188 0.033099 -1.212873
C  -0.241711 -2.879055 0.183052
C  -1.927385 -2.060158 1.684798
C  -2.522226 -3.663711 -0.02028
C  -1.190623 -3.676422 -0.432762
C  -2.873056 -2.843587 1.05149
C  -3.549155 -4.488058 -0.730265
H  3.537302 3.709855 -2.464188
H  4.439376 3.818836 -0.961266
H  5.167125 3.039156 -2.366945
H  2.386919 -1.719502 1.501512
H  2.126815 -0.002857 1.856452
H  5.10997 -1.658839 -1.286332
H  3.659389 -2.232683 -0.464008
H  3.650985 -2.025075 -2.224359
H  0.316691 2.907317 2.034081
H  -1.904777 2.216227 2.82219
H  -3.807997 -0.284324 -0.733921
H  -3.156359 0.601086 -2.104558
H  -2.361704 -0.862852 -1.545698
H  0.780833 -2.935089 -0.163715
H  -2.227871 -1.441479 2.519228
H  -0.890892 -4.320719 -1.25022
H  -3.899839 -2.821545 1.395123
H  -4.43817 -4.636819 -0.119171
H  -3.864004 -3.995001 -1.652569
H  -3.155423 -5.465333 -1.008663
elementType: Cl O N C H
totalener: -2106.08278793 hartree
nucrepener: 3277.21931254 hartree
electener: -5383.30210046 hartree
oneelecener: -9405.46324766 hartree
twoeener: 4022.16114720 hartree
cpcmener: -0.04627107 hartree
kineticenergy: 2099.72667170 hartree
xcener: -157.003180928241 hartree
chargesum: -0.0000000
charge: -0.074086 -0.083761 -0.353139 -0.471107 -0.440539 0.131672 -0.333216 -0.263295 0.300626 0.084026 0.421731 0.084129 -0.266343 0.016666 -0.165575 -0.044780 -0.042913 -0.124418 0.329535 -0.033759 0.171784 -0.222312 -0.263834 -0.169215 -0.097252 0.021236 -0.168726 -0.195972 -0.199965 0.105441 0.103269 0.096344 0.157226 0.128761 0.121219 0.118632 0.129020 0.145752 0.138977 0.093483 0.131280 0.105223 0.152461 0.135535 0.143461 0.139946 0.097125 0.106997 0.102650
qa: -0.0741 -0.0838 -0.3531 -0.4711 -0.4405 0.1317 -0.3332 -0.2633 0.3006 0.0840 0.4217 0.0841 -0.2663 0.0167 -0.1656 -0.0448 -0.0429 -0.1244 0.3295 -0.0338 0.1718 -0.2223 -0.2638 -0.1692 -0.0973 0.0212 -0.1687 -0.1960 -0.2000 0.1054 0.1033 0.0963 0.1572 0.1288 0.1212 0.1186 0.1290 0.1458 0.1390 0.0935 0.1313 0.1052 0.1525 0.1355 0.1435 0.1399 0.0971 0.1070 0.1027
va: 1.2697 1.2406 2.0150 2.0163 2.0270 3.3506 2.9299 3.5314 4.0437 4.0081 3.8512 3.4280 3.9593 3.7645 3.8939 3.9163 3.6948 3.9599 3.9526 3.4488 3.7027 4.0210 3.9256 3.9519 3.8691 3.7279 3.9234 3.9010 3.8940 0.9961 0.9980 1.0158 0.9849 1.0123 1.0044 0.9944 0.9866 1.0055 1.0097 1.0202 1.0026 0.9931 1.0023 1.0273 1.0000 1.0085 1.0043 0.9938 0.9998
dispcorr: -0.034904183 hartree
energy: -2106.117692110397
dipole: 7.64953 -7.76429 -0.11476 -19.59848 15.94953 -3.64895 -4.76473 4.17452 -0.59020
magnitude: 3.69815 au
magnitude: 9.39996 debye
