program: Orca
programVersion: 5.0.2
elementType: Cl Cl O O O N N C C C C C C C C C C C C C C C C C C C C C C H H H H H H H H H H H H H H H H H H H H
charge: 0
multiplicity: 1
keywords: wb97x-d3
keywords: def2-TZVPP
keywords: def2/J RIJCOSX
keywords: DEFGRID2
keywords: scfconv7
keywords: smallprint printgap noloewdin
keywords: NOSOSCF
formula: C22H20Cl2N2O3
InChI: InChI=1/C22H20Cl2N2O3/c1-12-5-7-15(8-6-12)18(27)11-29-22-19(14(3)25-26(22)4)21(28)16-9-10-17(23)13(2)20(16)24/h5-10H,11H2,1-4H3
49 atoms
Cl -1.486171 -0.216926 -1.908428
Cl -3.555417 2.721858 2.115769
O  2.123276 0.35003 1.590836
O  0.941374 1.468911 -2.625674
O  2.148995 -2.027624 0.298787
N  4.079039 0.600249 0.475733
N  4.624558 0.95356 -0.704466
C  2.374464 1.080001 -0.827089
C  2.748111 0.652329 0.453735
C  3.623677 1.225303 -1.501976
C  1.085462 1.364591 -1.417534
C  -0.081504 1.629062 -0.523832
C  3.880052 1.653633 -2.901234
C  0.96606 -0.464539 1.629057
C  4.904696 0.1533 1.573533
C  -1.316214 1.008617 -0.700934
C  -2.428091 1.292587 0.097095
C  0.046179 2.583492 0.478197
C  1.074325 -1.698406 0.758115
C  -0.16568 -2.448009 0.486652
C  -2.243304 2.267382 1.080011
C  -1.032217 2.912026 1.275434
C  -3.725631 0.581144 -0.121178
C  -1.349659 -2.198958 1.180057
C  -0.164397 -3.416126 -0.518987
C  -2.51324 -3.848553 -0.150541
C  -2.503035 -2.897947 0.868173
C  -1.322501 -4.099512 -0.833989
C  -3.774247 -4.560146 -0.528161
H  4.951317 1.75849 -3.064816
H  3.49878 0.928531 -3.619977
H  3.407415 2.60986 -3.125041
H  0.866984 -0.784157 2.669714
H  0.073396 0.111412 1.392572
H  5.936975 0.168238 1.239996
H  4.806041 0.809525 2.435718
H  4.643944 -0.863163 1.863095
H  0.992936 3.086006 0.627955
H  -0.930155 3.664549 2.044586
H  -3.592661 -0.499463 -0.070816
H  -4.473189 0.854104 0.616993
H  -4.133878 0.81138 -1.106016
H  -1.389192 -1.46701 1.976505
H  0.742624 -3.624984 -1.070721
H  -3.41173 -2.697238 1.422001
H  -1.307137 -4.838247 -1.626053
H  -3.577632 -5.583869 -0.84506
H  -4.484812 -4.584987 0.296674
H  -4.262761 -4.053704 -1.363696
elementType: Cl O N C H
totalener: -2106.08288185 hartree
nucrepener: 3226.65229099 hartree
electener: -5332.73517284 hartree
oneelecener: -9304.46680464 hartree
twoeener: 3971.73163180 hartree
cpcmener: -0.04678993 hartree
kineticenergy: 2099.70942297 hartree
xcener: -157.007770485774 hartree
chargesum: -0.0000000
charge: -0.068117 -0.078622 -0.349599 -0.460485 -0.444847 0.135959 -0.341769 -0.162457 0.219160 0.086880 0.323501 0.045136 -0.258055 0.079316 -0.160071 0.030249 -0.067663 -0.164767 0.365405 -0.036924 0.140168 -0.149118 -0.243271 -0.161426 -0.144418 0.033758 -0.198685 -0.172188 -0.198182 0.095550 0.098772 0.103250 0.164849 0.081983 0.111583 0.122150 0.115004 0.157767 0.143889 0.108231 0.087519 0.118756 0.146692 0.141185 0.152026 0.145929 0.101127 0.098544 0.106329
qa: -0.0681 -0.0786 -0.3496 -0.4605 -0.4448 0.1360 -0.3418 -0.1625 0.2192 0.0869 0.3235 0.0451 -0.2581 0.0793 -0.1601 0.0302 -0.0677 -0.1648 0.3654 -0.0369 0.1402 -0.1491 -0.2433 -0.1614 -0.1444 0.0338 -0.1987 -0.1722 -0.1982 0.0956 0.0988 0.1032 0.1648 0.0820 0.1116 0.1221 0.1150 0.1578 0.1439 0.1082 0.0875 0.1188 0.1467 0.1412 0.1520 0.1459 0.1011 0.0985 0.1063
va: 1.2729 1.2467 2.0810 2.0206 2.0218 3.3040 2.9380 3.4408 4.1149 3.9809 3.9220 3.3860 3.9502 3.8451 3.8895 3.9032 3.7397 3.9382 3.8256 3.5534 3.7884 4.0245 3.9282 3.9067 3.9701 3.7199 3.8971 3.9529 3.8936 1.0160 1.0011 0.9973 0.9890 1.0152 1.0106 0.9883 0.9992 0.9952 1.0072 0.9969 1.0240 0.9978 0.9995 1.0230 0.9969 1.0001 1.0006 1.0030 0.9951
dispcorr: -0.032619350 hartree
energy: -2106.115501198131
dipole: 5.27936 -7.46529 -2.18594 -16.90202 16.06308 -0.83894 0.68485 2.34456 3.02941
magnitude: 3.82877 au
magnitude: 9.73196 debye
