program: Gaussian 09
title: 000006271
version: EM64L-G09RevD.01
frameworkgroup: C1[X(C9H10O2)]
method: RPBEPBE
basis: SDD
operation: Freq
keyword: #pfreq=noraman
keyword: PBEPBE/SDD
title: #p freq=noraman PBEPBE/SDD
converged: NO YES NO NO
title: Mulliken charges:
elementType: O O C C C C C C C C C H H H H H H H H H H
charge: -0.229860 -0.420167 0.300284 -0.480947 0.126363 -0.318782 -0.328973 -0.684025 -0.401946 -0.348607 0.295391 0.228956 0.228917 0.244357 0.280615 0.231039 0.207092 0.230911 0.223061 0.257431 0.358891
chargesum: 0.00000
title: Mulliken charges with hydrogens summed into heavy atoms:
elementType: O O C C C C C C C C C
charge: -0.229860 -0.061276 0.300284 -0.023075 0.126363 -0.074425 -0.048359 -0.014983 -0.178885 -0.091176 0.295391
polarizability: 1.60753574e+02 -6.70972191e+00 1.04799971e+02 3.72658640e-03 8.95343884e-03 5.11353469e+01
1716.lowfreq: -2.3434 -0.0008 -0.0006 -0.0003 7.1016 13.3028 50.0484 76.0979 104.6829
frequency: 50.0318 76.0529 104.6755 144.0884 175.3353 279.4020 280.5529 306.6749 380.5217 399.6612 412.6787 467.4002 485.5736 564.9285 583.1887 631.1066 708.5098 725.5241 794.1316 810.5922 817.3052 856.6940 942.9989 946.3196 995.9120 1001.7612 1016.7111 1068.8261 1089.3766 1104.8954 1145.5912 1181.2503 1230.4779 1249.7456 1258.1054 1306.6201 1336.2191 1394.3770 1395.7204 1431.9212 1439.9358 1465.9322 1476.5121 1502.4218 1566.7203 1601.4714 1623.1704 2967.9508 2996.8073 3014.5834 3092.3311 3101.9591 3114.6042 3151.6646 3157.5382 3175.5344 3575.1632
redmass: 3.8395 1.8739 4.2151 3.8768 1.2887 4.1901 4.8472 5.7427 4.6429 1.2042 2.4591 4.9881 2.8946 2.0950 6.0228 7.0522 3.7711 3.1506 1.4558 6.2028 1.3566 1.4941 1.3564 4.4576 1.3364 2.6791 1.5582 1.6548 2.6826 1.3986 1.3619 1.1223 2.5600 1.1810 2.8183 1.3662 1.9394 1.3105 3.7356 3.7571 1.1062 1.0391 1.0530 2.6437 7.1246 7.4486 6.3805 1.0600 1.0364 1.0982 1.1001 1.0998 1.0896 1.0889 1.0939 1.0967 1.0660
irintensity: 0.2626 1.1260 0.0973 0.2518 0.7240 5.8530 0.0088 2.4639 23.2962 132.0783 17.0037 0.1691 14.6337 14.0225 16.6130 2.7448 2.7760 2.0030 64.2271 11.4563 0.4046 30.9617 0.0029 40.6112 0.2024 1.0056 7.2296 1.4695 3.5824 53.5268 318.7560 35.5352 146.4494 0.2027 38.2278 3.2272 93.6477 29.3187 0.7368 6.8379 18.6371 11.6274 16.1452 21.3582 179.5653 64.1699 109.7661 34.0000 31.6208 11.6717 28.0993 31.7607 17.2053 0.3479 11.1481 6.2396 57.2031
temp: 298.150 k
press: 1.00000 atm
elementType: 8 8 6 6 6 6 6 6 6 6 6 1 1 1 1 1 1 1 1 1 1
symmnumber: 1
zpe: 437688.2 jmol-1
zpe.correction: 0.166707 hartree
zpe.thermalcorrener: 0.177290 hartree
zpe.thermalcorrenthalpy: 0.178235 hartree
zpe.thermalcorrgfe: 0.130154 hartree
zpe.sumelectzpe: -498.596081 hartree
zpe.sumelectthermal: -498.585498 hartree
zpe.sumelectthermalent: -498.584554 hartree
zpe.sumelectthermalfe: -498.632634 hartree
dipole: 2.0577 -4.3475 0.0012
dipole: 4.8099
quadrupole: -63.1505 -60.5448 -67.3460
quadrupole: -0.5150 -0.0075 0.0099
quadrupole: 0.5300 3.1356 -3.6656 -0.5150 -0.0075 0.0099
hfenergy: -498.7627881 hartree
pointgroup: C01 [X(C9H10O2)]
dipole: 0.8131182 1.7087604 0.0036765 debye
dipolederiv: -0.9428265 -0.1211574 -0.0008014 -0.4409809 -0.7790477 -0.0012003 -0.0009484 -0.0005743 -0.3052535 -1.6785361 -0.1834617 -0.0015031 -0.1736608 -0.0873415 0.0006663 -0.0014624 0.0006521 -0.4197473 -1.03789 -0.0641617 -0.0008752 0.0569345 -0.2257192 -0.0002731 -0.0009812 -0.0003366 -0.0486025 -0.14224 0.119864 0.0000611 0.3284181 -0.2475541 -0.0007198 0.0014086 -0.0013453 0.156191 1.8667831 0.0381592 0.0013579 0.1020219 0.8381032 0.0012681 0.0011769 0.0012118 0.1075203 0.3421473 0.0862494 0.0006126 0.1568969 0.1105257 0.0006664 0.0003798 0.0005079 -0.1083968 0.2984444 0.0323166 0.0004155 -0.1609028 0.0925777 0.0003445 0.0001247 0.000401 -0.0891357 -0.0410646 -0.0288911 -0.0001744 -0.0092339 0.0872003 0.0001285 -0.0002553 0.00023 0.0607128 -0.5610678 -0.0206382 -0.0003211 0.4041609 0.0211771 0.0009027 0.0006975 0.0005657 -0.2094961 -0.3761895 -0.1167762 -0.0004336 -0.4264303 -0.0422638 -0.0000285 -0.0011614 0.0002144 -0.1788328 1.6105353 0.1935657 0.0017354 0.1330283 0.1906652 0.0003177 0.0015485 0.0003788 0.1009788 -0.0137347 -0.0334505 -0.0787041 -0.0481674 0.0265791 -0.0803715 -0.0809337 -0.095508 -0.0331319 -0.0140339 -0.0342566 0.0785796 -0.048999 0.0255401 0.080742 0.0804466 0.095966 -0.0317347 0.0536507 0.096515 0.0001553 0.1073551 -0.0208101 -0.0002784 0.0001897 -0.0002582 0.1381168 0.1215827 -0.0715913 -0.0002246 -0.0171004 0.0120439 -0.0003679 -0.0001324 -0.0003518 0.149294 0.0669682 -0.0122171 0.02288 -0.077806 0.0405994 0.1070585 0.054948 0.0895035 -0.0621374 -0.0590686 0.1031057 0.0000675 0.1770256 -0.0931446 -0.0003443 0.0002543 -0.0004405 0.1018505 0.0668804 -0.0118577 -0.022647 -0.0771235 0.0416017 -0.1067676 -0.0551087 -0.0890656 -0.0636409 -0.0113307 -0.1001923 -0.000397 -0.0969576 -0.0614751 -0.0006541 -0.0003603 -0.0006723 0.174604 0.0186501 0.0768911 0.0000529 0.0773638 0.0082595 -0.0003255 0.0000601 -0.0003341 0.1727893 0.4323401 0.0519852 0.0001636 0.0341574 0.062483 -0.0007637 0.0001092 -0.0007443 0.388052 unknown
polarizability: 160.7811223|6.5932289|104.7720657|0.1088127|0.1220597|51.1357038 unknown
InChI: InChI=1S/C9H10O2/c1-2-9(11)7-3-5-8(10)6-4-7/h3-6,10H,2H2,1H3
charge 0 multiplicity 1
21 atoms
O  -2.247429 -1.485954 -0.004647
O  3.951006 0.218217 0.00281
C  -0.271113 -0.113359 -0.00169
C  -2.669833 0.917229 -0.001625
C  -1.756878 -0.316666 -0.003448
C  0.333438 1.17353 0.001895
C  0.574864 -1.259639 -0.003624
C  -4.166212 0.561015 -0.004639
C  1.734002 1.315203 0.003518
C  1.97175 -1.134899 -0.002099
C  2.552998 0.157465 0.001495
H  -2.420686 1.536353 0.884912
H  -2.418198 1.541569 -0.88364
H  -0.286672 2.075737 0.003449
H  0.099565 -2.246208 -0.006326
H  -4.427536 -0.044295 0.879972
H  -4.784204 1.477067 -0.00288
H  -4.425246 -0.039216 -0.893407
H  2.18871 2.314477 0.006335
H  2.627324 -2.010392 -0.00362
H  4.270451 1.155167 0.00536
