program: Orca
programVersion: 5.0.2
elementType: Cl Cl O O O N N C C C C C C C C C C C C C C C C C C C C C C H H H H H H H H H H H H H H H H H H H H
charge: 0
multiplicity: 1
keywords: wb97x-d3
keywords: def2-TZVPP
keywords: def2/J RIJCOSX
keywords: DEFGRID2
keywords: scfconv7
keywords: smallprint printgap noloewdin
keywords: NOSOSCF
formula: C22H20Cl2N2O3
InChI: InChI=1/C22H20Cl2N2O3/c1-12-5-7-15(8-6-12)18(27)11-29-22-19(14(3)25-26(22)4)21(28)16-9-10-17(23)13(2)20(16)24/h5-10H,11H2,1-4H3
49 atoms
Cl -1.453543 -0.175189 -1.933631
Cl -3.561643 2.68235 2.12925
O  2.130678 0.338669 1.578021
O  0.958733 1.551102 -2.613695
O  2.115534 -2.004941 0.222978
N  4.087809 0.588397 0.467348
N  4.637574 0.964447 -0.704181
C  2.388989 1.117501 -0.823163
C  2.757757 0.655439 0.447108
C  3.63983 1.267085 -1.494131
C  1.101963 1.419223 -1.408107
C  -0.068922 1.656505 -0.512246
C  3.900888 1.72893 -2.881895
C  0.967693 -0.467489 1.6116
C  4.906557 0.097641 1.551183
C  -1.298703 1.031914 -0.705747
C  -2.418489 1.300262 0.086559
C  0.048154 2.593783 0.506593
C  1.05296 -1.683043 0.714057
C  -0.192062 -2.433826 0.467269
C  -2.243131 2.255841 1.089548
C  -1.035719 2.900905 1.304748
C  -3.712489 0.590936 -0.157313
C  -1.364004 -2.18268 1.18033
C  -0.206808 -3.410669 -0.530287
C  -2.544562 -3.853461 -0.107816
C  -2.519885 -2.890621 0.898846
C  -1.367008 -4.103065 -0.814748
C  -3.804869 -4.584729 -0.446023
H  4.972483 1.840295 -3.038926
H  3.524678 1.018857 -3.618775
H  3.426138 2.688834 -3.086472
H  0.878162 -0.808323 2.646254
H  0.077252 0.120683 1.397885
H  4.635668 -0.925195 1.805406
H  5.940057 0.113885 1.221418
H  4.811283 0.724942 2.434572
H  0.99152 3.097996 0.670858
H  -0.940691 3.638153 2.089311
H  -4.479498 0.878461 0.554377
H  -4.091616 0.807009 -1.156413
H  -3.58586 -0.489464 -0.086507
H  -1.392574 -1.443495 1.970657
H  0.688926 -3.6212 -1.099538
H  -3.417985 -2.688215 1.469201
H  -1.362799 -4.850164 -1.599262
H  -4.513664 -4.568411 0.380148
H  -4.294987 -4.125146 -1.306425
H  -3.605658 -5.623134 -0.708717
elementType: Cl O N C H
totalener: -2106.08298198 hartree
nucrepener: 3225.08566599 hartree
electener: -5331.16864797 hartree
oneelecener: -9301.35438536 hartree
twoeener: 3970.18573739 hartree
cpcmener: -0.04685220 hartree
kineticenergy: 2099.71822792 hartree
xcener: -157.009513265707 hartree
chargesum: 0.0000000
charge: -0.068294 -0.078758 -0.350085 -0.460545 -0.444861 0.135262 -0.341817 -0.166729 0.224324 0.087140 0.325793 0.039518 -0.258472 0.079350 -0.159920 0.033533 -0.071709 -0.161156 0.369234 -0.040575 0.143301 -0.151522 -0.242668 -0.161746 -0.144501 0.035057 -0.198119 -0.173261 -0.198709 0.095506 0.099012 0.102970 0.165237 0.082149 0.115296 0.111587 0.121824 0.157557 0.143859 0.087320 0.117091 0.109935 0.146161 0.141233 0.152051 0.145896 0.097698 0.106870 0.101680
qa: -0.0683 -0.0788 -0.3501 -0.4605 -0.4449 0.1353 -0.3418 -0.1667 0.2243 0.0871 0.3258 0.0395 -0.2585 0.0793 -0.1599 0.0335 -0.0717 -0.1612 0.3692 -0.0406 0.1433 -0.1515 -0.2427 -0.1617 -0.1445 0.0351 -0.1981 -0.1733 -0.1987 0.0955 0.0990 0.1030 0.1652 0.0821 0.1153 0.1116 0.1218 0.1576 0.1439 0.0873 0.1171 0.1099 0.1462 0.1412 0.1521 0.1459 0.0977 0.1069 0.1017
va: 1.2724 1.2463 2.0819 2.0210 2.0215 3.3033 2.9379 3.4433 4.1132 3.9802 3.9206 3.3880 3.9510 3.8483 3.8896 3.8959 3.7434 3.9368 3.8176 3.5494 3.7829 4.0264 3.9269 3.9077 3.9682 3.7196 3.8965 3.9535 3.8942 1.0160 1.0008 0.9974 0.9889 1.0144 0.9990 1.0106 0.9885 0.9954 1.0072 1.0242 0.9986 0.9964 0.9997 1.0233 0.9972 1.0002 1.0036 0.9951 1.0000
dispcorr: -0.032565691 hartree
energy: -2106.115547667662
dipole: 5.15861 -7.34226 -2.18365 -17.08471 16.15427 -0.93045 0.93137 2.15183 3.08319
magnitude: 3.89103 au
magnitude: 9.89022 debye
