program: Orca
programVersion: 5.0.2
elementType: Cl Cl O O O N N C C C C C C C C C C C C C C C C C C C C C C H H H H H H H H H H H H H H H H H H H H
charge: 0
multiplicity: 1
keywords: wb97x-d3
keywords: def2-TZVPP
keywords: def2/J RIJCOSX
keywords: DEFGRID2
keywords: scfconv7
keywords: smallprint printgap noloewdin
keywords: NOSOSCF
formula: C22H20Cl2N2O3
InChI: InChI=1/C22H20Cl2N2O3/c1-12-5-7-15(8-6-12)18(27)11-29-22-19(14(3)25-26(22)4)21(28)16-9-10-17(23)13(2)20(16)24/h5-10H,11H2,1-4H3
49 atoms
Cl 0.432904 2.771759 -2.759891
Cl -3.679702 5.387381 -0.400225
O  2.192792 -1.615366 -0.869409
O  -0.591565 -0.35399 -1.431474
O  2.184795 -2.616697 1.623729
N  3.259987 0.055311 0.261845
N  3.089359 1.296256 0.754776
C  1.170024 0.57777 -0.181733
C  2.148958 -0.42353 -0.287259
C  1.84703 1.62775 0.510864
C  -0.126585 0.585244 -0.806239
C  -0.969205 1.823796 -0.690679
C  1.351354 2.952698 0.973145
C  1.23028 -2.603556 -0.547976
C  4.551595 -0.586264 0.32123
C  -0.828955 2.886022 -1.57347
C  -1.642603 4.018944 -1.529958
C  -1.965641 1.873575 0.270356
C  1.376494 -3.111941 0.868852
C  0.48544 -4.216308 1.288539
C  -2.621572 4.022199 -0.533936
C  -2.793419 2.977564 0.356989
C  -1.509658 5.172865 -2.472308
C  -0.462795 -4.775708 0.429109
C  0.589066 -4.716201 2.586407
C  -1.184778 -6.302914 2.159021
C  -1.282647 -5.801983 0.860955
C  -0.235157 -5.742653 3.01177
C  -2.076475 -7.416458 2.612288
H  2.110797 3.422128 1.59746
H  1.144821 3.629552 0.144036
H  0.438064 2.864853 1.560403
H  0.214645 -2.238804 -0.708887
H  1.401792 -3.415718 -1.25585
H  5.000034 -0.654158 -0.668915
H  5.192419 0.0178 0.955559
H  4.47047 -1.582834 0.746615
H  -2.09104 1.052436 0.964388
H  -3.567596 3.020526 1.110629
H  -1.313445 6.098407 -1.929647
H  -0.704666 5.036335 -3.187684
H  -2.430444 5.320117 -3.038208
H  -0.578418 -4.416428 -0.58542
H  1.315558 -4.300074 3.27227
H  -2.013017 -6.2203 0.178694
H  -0.141047 -6.114566 4.024767
H  -1.949402 -7.628944 3.672858
H  -3.126772 -7.177124 2.43974
H  -1.865725 -8.335292 2.061492
elementType: Cl O N C H
totalener: -2106.09642765 hartree
nucrepener: 2986.59499109 hartree
electener: -5092.69141874 hartree
oneelecener: -8825.26470297 hartree
twoeener: 3732.57328423 hartree
cpcmener: -0.03199334 hartree
kineticenergy: 2099.71826279 hartree
xcener: -157.001868431636 hartree
chargesum: -0.0000000
charge: -0.074993 -0.081562 -0.333197 -0.455817 -0.431580 0.133575 -0.330777 -0.218726 0.253792 0.083059 0.383470 0.112204 -0.271605 -0.007919 -0.166620 -0.034080 -0.027278 -0.166103 0.404422 -0.081471 0.071969 -0.160034 -0.232519 -0.142843 -0.128646 0.023885 -0.187628 -0.175179 -0.200033 0.108107 0.109149 0.111914 0.145001 0.148149 0.124676 0.111680 0.114935 0.145969 0.142320 0.108288 0.086928 0.110228 0.141095 0.143527 0.143582 0.143789 0.093132 0.104089 0.105676
qa: -0.0750 -0.0816 -0.3332 -0.4558 -0.4316 0.1336 -0.3308 -0.2187 0.2538 0.0831 0.3835 0.1122 -0.2716 -0.0079 -0.1666 -0.0341 -0.0273 -0.1661 0.4044 -0.0815 0.0720 -0.1600 -0.2325 -0.1428 -0.1286 0.0239 -0.1876 -0.1752 -0.2000 0.1081 0.1091 0.1119 0.1450 0.1481 0.1247 0.1117 0.1149 0.1460 0.1423 0.1083 0.0869 0.1102 0.1411 0.1435 0.1436 0.1438 0.0931 0.1041 0.1057
va: 1.2623 1.2466 2.1062 2.0277 2.0529 3.3243 2.9183 3.4610 4.1407 3.9562 3.8829 3.5138 3.9898 3.8368 3.8857 3.9174 3.7223 3.9805 3.7933 3.6672 3.8587 4.0054 3.9261 3.9534 3.9748 3.7422 3.9667 3.9519 3.9013 1.0192 0.9891 0.9886 1.0034 0.9951 0.9864 1.0100 1.0055 1.0028 1.0070 0.9990 1.0238 0.9982 1.0051 1.0247 1.0016 1.0022 1.0059 0.9966 0.9953
dispcorr: -0.026487424 hartree
energy: -2106.122915074159
dipole: 5.84418 -6.65470 -0.81052 -31.54730 29.75357 -1.79373 15.09852 -14.54396 0.55455
magnitude: 2.04498 au
magnitude: 5.19793 debye
