program: Orca
programVersion: 5.0.2
elementType: Cl Cl O O O N N C C C C C C C C C C C C C C C C C C C C C C H H H H H H H H H H H H H H H H H H H H
charge: 0
multiplicity: 1
keywords: wb97x-d3
keywords: def2-TZVPP
keywords: def2/J RIJCOSX
keywords: DEFGRID2
keywords: scfconv7
keywords: smallprint printgap noloewdin
keywords: NOSOSCF
formula: C22H20Cl2N2O3
InChI: InChI=1/C22H20Cl2N2O3/c1-12-5-7-15(8-6-12)18(27)11-29-22-19(14(3)25-26(22)4)21(28)16-9-10-17(23)13(2)20(16)24/h5-10H,11H2,1-4H3
49 atoms
Cl -0.931048 1.500587 -3.023643
Cl -3.821651 3.708539 0.98003
O  3.394598 -1.511578 -0.007323
O  0.406196 -0.821454 -1.361232
O  1.572386 -1.42469 1.94167
N  4.164015 0.595515 0.161939
N  3.832294 1.896218 0.030114
C  2.044803 0.596456 -0.426086
C  3.144163 -0.216852 -0.114011
C  2.567106 1.919353 -0.298538
C  0.701208 0.222393 -0.805744
C  -0.396102 1.166006 -0.415335
C  1.890943 3.221496 -0.550875
C  2.381888 -2.494539 -0.006144
C  5.494827 0.209197 0.564859
C  -1.260479 1.74607 -1.337984
C  -2.334093 2.553511 -0.958102
C  -0.605893 1.3926 0.936868
C  1.360766 -2.260972 1.089984
C  0.118091 -3.05932 1.062049
C  -2.507377 2.730516 0.417343
C  -1.668629 2.167218 1.361859
C  -3.266768 3.206316 -1.928608
C  -0.946095 -2.679294 1.879918
C  -0.03314 -4.174636 0.237586
C  -2.294357 -4.497868 1.030816
C  -2.135166 -3.384209 1.855064
C  -1.219769 -4.88647 0.232087
C  -3.593955 -5.238125 0.977481
H  1.147738 3.45375 0.212453
H  2.629333 4.022548 -0.550151
H  1.384823 3.234484 -1.516488
H  1.910068 -2.571797 -0.984823
H  2.899107 -3.43814 0.186508
H  5.460941 -0.464436 1.419312
H  6.032875 -0.273103 -0.250301
H  6.027614 1.110309 0.852643
H  0.062719 0.956422 1.667622
H  -1.83617 2.332192 2.417192
H  -4.293326 2.878454 -1.759857
H  -3.251149 4.291032 -1.814857
H  -3.017814 2.981554 -2.960891
H  -0.85354 -1.817845 2.52849
H  0.773148 -4.508031 -0.403414
H  -2.955568 -3.064218 2.486074
H  -1.314712 -5.755134 -0.40814
H  -3.441314 -6.310371 0.854254
H  -4.186096 -5.078765 1.877911
H  -4.193904 -4.900014 0.129297
elementType: Cl O N C H
totalener: -2106.09377818 hartree
nucrepener: 3114.45453952 hartree
electener: -5220.54831770 hartree
oneelecener: -9081.55593320 hartree
twoeener: 3861.00761550 hartree
cpcmener: -0.03260748 hartree
kineticenergy: 2099.70869408 hartree
xcener: -157.001856304771 hartree
chargesum: -0.0000000
charge: -0.073121 -0.080490 -0.312342 -0.419936 -0.414621 0.105979 -0.332414 -0.169499 0.318913 0.078912 0.245963 0.067077 -0.281010 -0.002810 -0.167218 0.040007 -0.022036 -0.190243 0.351354 -0.034394 0.073562 -0.157939 -0.233194 -0.154748 -0.159970 0.010442 -0.161991 -0.165578 -0.201976 0.110234 0.106764 0.104919 0.142687 0.149185 0.117032 0.121153 0.112052 0.156787 0.142784 0.109511 0.109121 0.086801 0.141578 0.143994 0.143249 0.142379 0.099435 0.095685 0.107972
qa: -0.0731 -0.0805 -0.3123 -0.4199 -0.4146 0.1060 -0.3324 -0.1695 0.3189 0.0789 0.2460 0.0671 -0.2810 -0.0028 -0.1672 0.0400 -0.0220 -0.1902 0.3514 -0.0344 0.0736 -0.1579 -0.2332 -0.1547 -0.1600 0.0104 -0.1620 -0.1656 -0.2020 0.1102 0.1068 0.1049 0.1427 0.1492 0.1170 0.1212 0.1121 0.1568 0.1428 0.1095 0.1091 0.0868 0.1416 0.1440 0.1432 0.1424 0.0994 0.0957 0.1080
va: 1.2639 1.2474 2.1418 2.0396 2.0606 3.3066 2.9416 3.3348 4.0800 3.9598 3.9850 3.4115 3.9903 3.8465 3.8933 3.8604 3.7197 3.9174 3.8139 3.5490 3.8643 4.0629 3.9219 3.9802 3.9821 3.7550 3.9514 3.9450 3.9007 0.9879 1.0189 0.9959 1.0082 0.9879 0.9940 0.9879 1.0107 1.0020 1.0078 0.9983 0.9984 1.0248 1.0208 1.0044 1.0009 1.0011 1.0001 1.0036 0.9936
dispcorr: -0.028820539 hartree
energy: -2106.122598722996
dipole: 5.63527 -5.92768 -0.29242 -19.34938 17.65588 -1.69351 6.44687 -6.14579 0.30108
magnitude: 1.74474 au
magnitude: 4.43478 debye
