program: Orca
programVersion: 5.0.2
elementType: Cl Cl O O O N N C C C C C C C C C C C C C C C C C C C C C C H H H H H H H H H H H H H H H H H H H H
charge: 0
multiplicity: 1
keywords: wb97x-d3
keywords: def2-TZVPP
keywords: def2/J RIJCOSX
keywords: DEFGRID2
keywords: scfconv7
keywords: smallprint printgap noloewdin
keywords: NOSOSCF
formula: C22H20Cl2N2O3
InChI: InChI=1/C22H20Cl2N2O3/c1-12-5-7-15(8-6-12)18(27)11-29-22-19(14(3)25-26(22)4)21(28)16-9-10-17(23)13(2)20(16)24/h5-10H,11H2,1-4H3
49 atoms
Cl -1.034913 1.429879 -2.98771
Cl -3.802116 3.61988 1.109311
O  3.423262 -1.502948 0.000069
O  0.440866 -0.807894 -1.386499
O  1.592146 -1.414708 1.942302
N  4.203854 0.604166 0.127954
N  3.875184 1.903842 -0.020871
C  2.081058 0.603147 -0.446017
C  3.179163 -0.208818 -0.129353
C  2.607553 1.925483 -0.341014
C  0.733853 0.229375 -0.818298
C  -0.364276 1.159106 -0.400339
C  1.928416 3.223049 -0.60819
C  2.403881 -2.479159 -0.007979
C  5.536457 0.218846 0.525736
C  -1.290466 1.692585 -1.292125
C  -2.372348 2.470671 -0.875828
C  -0.516458 1.410907 0.955504
C  1.372488 -2.23472 1.077025
C  0.109811 -2.998979 1.018962
C  -2.484617 2.673232 0.502649
C  -1.582152 2.160391 1.416219
C  -3.375553 3.066915 -1.811876
C  -0.050962 -4.108163 0.191446
C  -0.967642 -2.583825 1.80495
C  -2.345898 -4.358167 0.910732
C  -1.260888 -4.782318 0.14841
C  -2.176272 -3.248086 1.741166
C  -3.66912 -5.053843 0.836304
H  1.399805 3.213968 -1.561721
H  1.202364 3.472824 0.166144
H  2.666556 4.023569 -0.641845
H  1.943865 -2.555635 -0.992169
H  2.911508 -3.426026 0.193906
H  5.508361 -0.434386 1.39615
H  6.062596 -0.28564 -0.283717
H  6.077875 1.123064 0.786439
H  0.198874 1.01146 1.662451
H  -1.703279 2.34351 2.474841
H  -3.396625 4.153631 -1.720877
H  -3.169096 2.828715 -2.850433
H  -4.379017 2.704013 -1.585489
H  0.763265 -4.467028 -0.425345
H  -0.867681 -1.723778 2.454297
H  -1.363951 -5.646438 -0.496206
H  -3.007079 -2.898972 2.342935
H  -4.428103 -4.400024 0.401907
H  -3.618947 -5.954399 0.225833
H  -4.025438 -5.3376 1.827692
elementType: Cl O N C H
totalener: -2106.09345014 hartree
nucrepener: 3123.53359819 hartree
electener: -5229.62704833 hartree
oneelecener: -9099.69957500 hartree
twoeener: 3870.07252667 hartree
cpcmener: -0.03259145 hartree
kineticenergy: 2099.70792273 hartree
xcener: -157.001679111752 hartree
chargesum: -0.0000000
charge: -0.072880 -0.080091 -0.311651 -0.416460 -0.413411 0.104513 -0.332226 -0.164869 0.319293 0.073673 0.248426 0.060909 -0.277548 -0.005128 -0.167281 0.043846 -0.019713 -0.201670 0.352466 -0.031996 0.075713 -0.155144 -0.234059 -0.158594 -0.160428 0.011980 -0.162759 -0.168306 -0.201301 0.104140 0.109942 0.106641 0.142885 0.149091 0.117134 0.120986 0.111853 0.157718 0.142949 0.109256 0.086881 0.109718 0.144626 0.142119 0.142609 0.143820 0.106411 0.092469 0.103451
qa: -0.0729 -0.0801 -0.3117 -0.4165 -0.4134 0.1045 -0.3322 -0.1649 0.3193 0.0737 0.2484 0.0609 -0.2775 -0.0051 -0.1673 0.0438 -0.0197 -0.2017 0.3525 -0.0320 0.0757 -0.1551 -0.2341 -0.1586 -0.1604 0.0120 -0.1628 -0.1683 -0.2013 0.1041 0.1099 0.1066 0.1429 0.1491 0.1171 0.1210 0.1119 0.1577 0.1429 0.1093 0.0869 0.1097 0.1446 0.1421 0.1426 0.1438 0.1064 0.0925 0.1035
va: 1.2637 1.2479 2.1417 2.0412 2.0628 3.3068 2.9425 3.3244 4.0788 3.9688 3.9789 3.3878 3.9885 3.8448 3.8937 3.8600 3.7164 3.9159 3.8174 3.5438 3.8636 4.0652 3.9216 3.9815 3.9763 3.7507 3.9394 3.9568 3.9003 0.9959 0.9884 1.0185 1.0086 0.9879 0.9936 0.9880 1.0108 1.0012 1.0075 0.9984 1.0248 0.9982 1.0043 1.0201 1.0019 1.0003 0.9951 1.0058 0.9971
dispcorr: -0.028998180 hartree
energy: -2106.122448318304
dipole: 5.55648 -5.89764 -0.34116 -18.59376 16.97117 -1.62259 5.69520 -5.40611 0.28910
magnitude: 1.68308 au
magnitude: 4.27805 debye
