program: Gaussian 09
title: 000059450
version: EM64L-G09RevD.01
frameworkgroup: C1[X(C22H30N3O2)]
method: RPBEPBE
basis: SDD
operation: Freq
keyword: #p
keyword: freq=noraman
keyword: PBEPBE/SDD
title: #p freq=noraman PBEPBE/SDD
converged: YES YES NO NO
title: Mulliken charges:
elementType: O O N N N C C C C C C C C C C C C C C C C C C C C C C H H H H H H H H H H H H H H H H H H H H H H H H H H H H H H
charge: -0.222989 -0.222918 -0.159300 -0.095706 -0.418322 -0.422408 0.385540 -0.383386 0.243457 0.236136 -0.668052 -0.326526 -0.333304 -0.336448 0.450683 -0.339202 -0.208350 -0.194032 -0.657724 -0.670604 -0.521367 -0.425914 0.215693 -0.338287 0.193878 -0.534266 -0.535567 0.242199 0.269403 0.238639 0.212887 0.267519 0.276191 0.386276 0.215857 0.186603 0.204982 0.224051 0.264203 0.265386 0.256537 0.258754 0.220210 0.222592 0.223429 0.235511 0.233405 0.190865 0.255562 0.244628 0.260907 0.268450 0.215544 0.227354 0.231748 0.265368 0.224226
chargesum: 1.00000
title: Mulliken charges with hydrogens summed into heavy atoms:
elementType: O O N N N C C C C C C C C C C C C C C C C C C C C C C
charge: -0.222989 -0.222918 -0.159300 -0.095706 -0.032046 0.089195 0.385540 0.068140 0.243457 0.236136 -0.124342 0.075935 0.095729 -0.072245 0.450683 -0.073816 0.048187 0.064722 0.008505 -0.010823 -0.265805 -0.181287 0.215693 -0.077381 0.193878 0.177082 0.185774
polarizability: 3.56708803e+02 -3.19515467e+00 2.72516515e+02 -2.16188938e+00 6.33109639e+00 2.08376428e+02
1716.lowfreq: -2.0509 -0.0006 0.0005 0.0008 2.6215 5.0825 7.8995 13.6942 20.5331
frequency: 7.3229 13.5159 20.4648 21.1836 36.7628 49.8803 55.6358 68.4487 81.7662 93.0294 97.3407 101.7184 134.5495 148.7126 156.9711 176.4838 190.4074 206.9669 211.9123 214.6679 231.9856 238.1823 261.0512 273.2589 280.5795 288.7234 314.8842 331.0460 350.4375 355.6447 364.5356 392.5154 427.5459 442.0781 456.6008 463.6886 477.6531 490.3639 528.3559 566.3102 570.9880 581.3077 592.5681 623.5321 642.9466 677.9491 708.3702 716.7253 731.3430 736.6952 749.5674 756.6668 762.7390 766.5803 787.7666 794.9531 797.9503 813.3327 848.4930 863.7304 865.0143 892.9533 905.7895 920.0347 922.5847 934.3976 954.8747 973.2826 994.8122 996.8801 999.3379 1013.3114 1022.2475 1060.6095 1072.4042 1078.0168 1084.7853 1102.8933 1111.2761 1111.7243 1121.7748 1134.5539 1143.6267 1146.9449 1156.2184 1168.4507 1176.0988 1176.6152 1180.7201 1211.5254 1225.2950 1228.3216 1233.9407 1257.3626 1267.3766 1273.4641 1282.9018 1290.5220 1293.1440 1295.7299 1305.4016 1325.8567 1339.7930 1363.2629 1364.3798 1381.8157 1389.6724 1395.4270 1397.0072 1415.5202 1419.6159 1436.2908 1437.6110 1446.3058 1447.2073 1458.9817 1463.7662 1465.5198 1465.9132 1466.4924 1469.5444 1471.2702 1471.8973 1477.3632 1479.7857 1485.1243 1486.8075 1491.5014 1503.5158 1510.4312 1523.1882 1585.3415 1602.7893 1615.9916 1631.6056 2885.3750 2886.0797 2896.4655 2963.5835 2971.6574 2976.2382 2979.8262 2991.9322 3001.5980 3027.2516 3043.1192 3049.0625 3049.6968 3055.1314 3066.1172 3073.3931 3087.2577 3096.0648 3096.5334 3112.0436 3133.6145 3141.0360 3143.6322 3145.6239 3156.4372 3164.2722 3172.9008 3174.5069 3186.7866 3534.8039
redmass: 4.4190 3.8941 3.8888 3.6857 5.0687 2.8841 3.3307 2.9326 2.0454 3.4712 3.3858 4.0802 2.2626 2.6887 3.1818 3.1105 2.1816 1.7140 2.5957 1.8130 1.2413 1.6892 1.6776 2.1205 2.6537 2.7039 3.1125 2.4707 3.8858 4.2551 4.4753 3.2944 3.0249 2.8621 5.0265 3.5317 2.8413 4.6463 5.4020 4.2161 3.6756 4.0384 5.2274 5.5178 4.7357 4.3094 1.2692 3.8705 3.6942 4.0899 3.6755 3.6104 2.1214 1.3186 1.3157 1.2981 1.2458 1.5466 2.0630 2.3125 1.3898 3.5507 2.6947 2.1825 1.3828 2.9172 1.3645 8.2001 2.1942 4.2196 1.3325 2.0902 4.2421 1.8784 2.4575 1.9321 2.1725 2.8630 1.2593 1.2594 1.7569 1.6774 1.9108 1.7058 1.3968 1.6089 1.3521 1.3427 1.1576 2.2200 1.5543 2.2347 2.4528 1.5200 2.9120 1.4654 1.1854 1.9366 1.2999 1.5456 1.7186 1.5746 1.4932 1.3610 1.3099 1.3217 1.2360 1.2206 3.1551 3.3672 5.6570 1.2178 1.1924 1.6049 2.2639 1.3870 1.0748 1.2718 1.1025 1.0587 1.0583 1.0497 1.0500 1.2724 1.1491 1.0757 1.1196 1.0955 3.3110 2.8949 3.8168 7.0515 6.1604 7.2093 7.4889 1.0714 1.0699 1.0713 1.0335 1.0329 1.0386 1.0600 1.0367 1.0895 1.0995 1.0764 1.0832 1.0783 1.1041 1.1047 1.0950 1.0987 1.1008 1.1007 1.1066 1.0902 1.0982 1.1001 1.0915 1.0875 1.0909 1.0940 1.0966 1.1007 1.0820
irintensity: 0.3434 0.2103 0.5057 0.0552 0.1646 0.1238 0.4647 0.7019 0.1581 12.5389 3.6677 0.5310 1.7020 0.5564 0.5167 3.7855 0.4652 0.8924 1.8461 1.5207 0.8000 1.0738 0.5616 1.1842 2.8440 2.0117 2.0211 3.9420 6.7399 2.5698 6.2307 7.7244 7.3985 6.3722 0.4824 1.3199 4.2598 4.8967 4.3761 10.1752 1.2257 15.8485 12.0578 5.3149 0.5913 0.5133 27.4093 1.6861 13.8665 3.9869 2.2958 3.4513 16.7939 108.5878 13.4801 11.6011 10.5406 34.3978 12.9712 26.2046 0.5053 1.6919 5.6432 1.1351 1.4747 0.9189 1.8957 35.6633 6.3656 45.6898 0.0628 3.2276 12.2271 26.2688 19.7845 56.4058 3.6073 4.9102 0.1505 0.0517 8.9684 107.2481 3.9797 31.0010 12.3114 17.3003 13.4956 4.4896 10.0398 59.0219 87.3390 54.3953 29.0514 5.7797 182.9979 28.9656 13.7312 41.6732 45.9331 38.9017 9.6417 8.6143 4.9802 3.4734 14.4878 0.5476 19.3854 24.1562 20.9119 11.5045 0.2744 57.8074 19.3021 11.4982 57.8408 24.8088 10.9402 6.7332 89.8383 34.6843 4.4117 9.2917 26.8106 4.6704 5.3663 19.1758 20.9422 10.5045 41.0066 191.5011 34.9069 45.5357 48.5185 16.7364 8.0389 65.3856 20.5188 150.2830 50.5606 51.2659 25.2578 21.5242 27.3241 43.7931 2.8903 4.4186 3.1888 16.7894 40.1310 37.2612 75.8099 39.5230 9.7100 55.4835 8.1361 11.3451 9.8073 12.0616 5.9032 0.0955 1.7287 4.7280 2.9172 2.7733 200.2123
temp: 298.150 k
press: 1.00000 atm
elementType: 8 8 7 7 7 6 6 6 6 6 6 6 6 6 6 6 6 6 6 6 6 6 6 6 6 6 6 1 1 1 1 1 1 1 1 1 1 1 1 1 1 1 1 1 1 1 1 1 1 1 1 1 1 1 1 1 1
symmnumber: 1
zpe: 1266147.0 jmol-1
zpe.correction: 0.482250 hartree
zpe.thermalcorrener: 0.510130 hartree
zpe.thermalcorrenthalpy: 0.511074 hartree
zpe.thermalcorrgfe: 0.419208 hartree
zpe.sumelectzpe: -1168.783337 hartree
zpe.sumelectthermal: -1168.755457 hartree
zpe.sumelectthermalent: -1168.754513 hartree
zpe.sumelectthermalfe: -1168.846379 hartree
dipole: -2.1836 3.0370 -0.5851
dipole: 3.7860
quadrupole: -97.1551 -123.5148 -145.1177
quadrupole: 2.0722 -12.1529 -1.3586
quadrupole: 24.7741 -1.5856 -23.1885 2.0722 -12.1529 -1.3586
hfenergy: -1169.2655874 hartree
pointgroup: C01 [X(C22H30N3O2)]
dipole: -1.1169379 -0.9709439 -0.1685382 debye
polarizability: 352.5535325|-19.5051923|266.1423797|8.9828386|23.1222445|218.9058328 unknown
InChI: InChI=1S/C22H30N3O2/c1-5-24(6-2)13-14-25-19-10-8-7-9-18(19)23-22(25)16-17-11-12-20(26-3)21(15-17)27-4/h7-12,15,23H,5-6,13-14,16H2,1-4H3
charge 1 multiplicity 1
57 atoms
O  5.07457 0.721851 -1.577885
O  6.247541 -0.873604 0.149756
N  -1.566229 -0.326108 0.211128
N  -3.635232 2.852991 0.398835
N  0.208966 -1.48267 -0.440189
C  -2.420952 0.743706 0.783187
C  -0.199703 -0.383488 0.260522
C  -2.774694 1.85573 -0.248565
C  -2.046588 -1.420302 -0.557428
C  -0.9040 -2.165693 -0.970469
C  0.732589 0.558907 0.977503
C  -2.892284 3.991166 1.011126
C  -4.833744 3.252105 -0.390811
C  -3.352788 -1.817231 -0.905284
C  2.197135 0.173781 0.794526
C  -1.019103 -3.333603 -1.748578
C  -3.470272 -2.987029 -1.68376
C  -2.32636 -3.730078 -2.098111
C  -3.610871 4.601584 2.228296
C  -5.887474 2.134254 -0.496663
C  2.924792 0.653603 -0.331432
C  2.837167 -0.676678 1.719566
C  4.276351 0.294978 -0.525826
C  4.19104 -1.049134 1.534237
C  4.921982 -0.576824 0.422056
C  4.497818 1.665255 -2.543869
C  6.974052 -1.723404 1.106237
H  -1.901932 1.185849 1.649816
H  -3.352176 0.286554 1.154374
H  -3.303535 1.395125 -1.10246
H  -1.831871 2.293806 -0.655276
H  0.546845 1.588858 0.614522
H  0.468653 0.560616 2.053588
H  1.199243 -1.728977 -0.523919
H  -2.685945 4.786446 0.254386
H  -1.90468 3.61099 1.340489
H  -4.548767 3.604895 -1.41179
H  -5.291099 4.115236 0.122764
H  -4.237742 -1.256943 -0.590333
H  -0.145704 -3.909511 -2.066932
H  -4.465057 -3.335192 -1.977392
H  -2.467817 -4.631809 -2.701207
H  -4.589451 5.03473 1.956605
H  -3.78263 3.833482 3.002144
H  -3.001407 5.413977 2.664005
H  -6.771617 2.496054 -1.051653
H  -6.212206 1.815372 0.508924
H  -5.504875 1.248337 -1.039534
H  2.438797 1.332941 -1.040139
H  2.297993 -1.040304 2.601969
H  4.672739 -1.697704 2.270766
H  5.309975 1.87103 -3.254425
H  3.638658 1.216547 -3.079706
H  4.188124 2.604851 -2.047378
H  7.017691 -1.249278 2.104783
H  7.986552 -1.809562 0.689053
H  6.511531 -2.725979 1.180456
