program: Orca
programVersion: 5.0.2
elementType: Cl Cl O O O N N C C C C C C C C C C C C C C C C C C C C C C H H H H H H H H H H H H H H H H H H H H
charge: 0
multiplicity: 1
keywords: wb97x-d3
keywords: def2-TZVPP
keywords: def2/J RIJCOSX
keywords: DEFGRID2
keywords: scfconv7
keywords: smallprint printgap noloewdin
keywords: NOSOSCF
formula: C22H20Cl2N2O3
InChI: InChI=1/C22H20Cl2N2O3/c1-12-5-7-15(8-6-12)18(27)11-29-22-19(14(3)25-26(22)4)21(28)16-9-10-17(23)13(2)20(16)24/h5-10H,11H2,1-4H3
49 atoms
Cl -0.350193 1.667202 -2.602959
Cl -4.318696 2.845713 0.871373
O  0.377398 -0.43759 -0.093418
O  2.191146 3.554227 -0.311377
O  1.008718 -1.514595 3.097829
N  2.50547 -0.916347 -0.883938
N  3.649619 -0.309081 -1.248927
C  2.155481 1.230944 -0.574528
C  1.590917 -0.040247 -0.470168
C  3.467181 0.975369 -1.059213
C  1.545782 2.521359 -0.347291
C  0.066258 2.588366 -0.10802
C  4.544592 1.946802 -1.375143
C  0.05545 -0.327783 1.294581
C  2.40568 -2.35562 -0.947787
C  -0.883645 2.200177 -1.043311
C  -2.25979 2.2557 -0.80417
C  -0.372576 3.099078 1.107157
C  0.391566 -1.599587 2.057615
C  -0.053824 -2.903046 1.522042
C  -2.641077 2.740697 0.447582
C  -1.721148 3.167056 1.393208
C  -3.233434 1.824794 -1.855109
C  -1.076867 -3.016222 0.580907
C  0.56484 -4.066054 1.984879
C  -0.835945 -5.423575 0.557218
C  -1.463907 -4.261606 0.114227
C  0.185047 -5.303158 1.501553
C  -1.26026 -6.769506 0.058866
H  5.403306 1.426351 -1.797062
H  4.212158 2.694735 -2.095712
H  4.874922 2.481823 -0.484772
H  0.583501 0.50414 1.76244
H  -1.016919 -0.127888 1.35649
H  2.756532 -2.813398 -0.023694
H  1.377833 -2.656005 -1.129868
H  3.022405 -2.702333 -1.772484
H  0.347577 3.422319 1.847535
H  -2.054664 3.549289 2.347924
H  -3.031138 0.804616 -2.182578
H  -4.26006 1.857748 -1.502888
H  -3.167474 2.46635 -2.735085
H  -1.596472 -2.142992 0.208664
H  1.363344 -4.001786 2.713021
H  -2.264014 -4.329643 -0.613088
H  0.690762 -6.192361 1.858781
H  -1.751898 -6.704629 -0.911116
H  -0.412185 -7.447986 -0.032328
H  -1.967408 -7.232087 0.751713
elementType: Cl O N C H
totalener: -2106.09200090 hartree
nucrepener: 3132.68792425 hartree
electener: -5238.77992515 hartree
oneelecener: -9115.31853370 hartree
twoeener: 3876.53860855 hartree
cpcmener: -0.03610352 hartree
kineticenergy: 2099.71170225 hartree
xcener: -156.994864313239 hartree
chargesum: -0.0000000
charge: -0.070898 -0.080609 -0.353652 -0.436717 -0.406566 0.141426 -0.328318 -0.231531 0.284608 0.069270 0.372440 0.056206 -0.259674 0.080273 -0.183594 -0.011055 -0.038151 -0.140454 0.315833 -0.048721 0.112705 -0.182576 -0.229905 -0.175970 -0.140729 0.009394 -0.157752 -0.164946 -0.199600 0.096273 0.101541 0.102616 0.120272 0.133417 0.127881 0.123476 0.127807 0.148616 0.140305 0.105709 0.085973 0.112882 0.143157 0.139114 0.143286 0.143859 0.095943 0.099714 0.107421
qa: -0.0709 -0.0806 -0.3537 -0.4367 -0.4066 0.1414 -0.3283 -0.2315 0.2846 0.0693 0.3724 0.0562 -0.2597 0.0803 -0.1836 -0.0111 -0.0382 -0.1405 0.3158 -0.0487 0.1127 -0.1826 -0.2299 -0.1760 -0.1407 0.0094 -0.1578 -0.1649 -0.1996 0.0963 0.1015 0.1026 0.1203 0.1334 0.1279 0.1235 0.1278 0.1486 0.1403 0.1057 0.0860 0.1129 0.1432 0.1391 0.1433 0.1439 0.0959 0.0997 0.1074
va: 1.2736 1.2434 2.0105 2.0577 2.0780 3.3243 2.9290 3.4793 4.0611 4.0336 3.9050 3.4380 3.9583 3.6321 3.9001 3.8827 3.7350 3.9658 4.0023 3.5044 3.7958 4.0357 3.9279 3.9447 3.9580 3.7490 3.9422 3.9401 3.8980 1.0156 0.9978 0.9987 1.0234 0.9871 0.9841 0.9882 1.0078 1.0055 1.0084 1.0003 1.0231 0.9977 1.0065 1.0224 1.0002 0.9999 1.0033 1.0004 0.9944
dispcorr: -0.029987197 hartree
energy: -2106.121988097423
dipole: 9.45407 -11.52034 -2.06627 -31.61003 28.71702 -2.89301 0.14968 -0.48838 -0.33870
magnitude: 3.57123 au
magnitude: 9.07734 debye
