program: Orca
programVersion: 5.0.2
elementType: Cl Cl O O O N N C C C C C C C C C C C C C C C C C C C C C C H H H H H H H H H H H H H H H H H H H H
charge: 0
multiplicity: 1
keywords: wb97x-d3
keywords: def2-TZVPP
keywords: def2/J RIJCOSX
keywords: DEFGRID2
keywords: scfconv7
keywords: smallprint printgap noloewdin
keywords: NOSOSCF
formula: C22H20Cl2N2O3
InChI: InChI=1/C22H20Cl2N2O3/c1-12-5-7-15(8-6-12)18(27)11-29-22-19(14(3)25-26(22)4)21(28)16-9-10-17(23)13(2)20(16)24/h5-10H,11H2,1-4H3
49 atoms
Cl -0.375356 1.589501 -2.626269
Cl -4.29607 2.697903 0.928651
O  0.474832 -0.419659 -0.066248
O  2.143106 3.611469 -0.477739
O  1.080145 -1.55622 3.106335
N  2.620521 -0.86929 -0.830161
N  3.74614 -0.241754 -1.220057
C  2.196955 1.277673 -0.627233
C  1.675978 -0.005458 -0.461963
C  3.517748 1.04378 -1.098188
C  1.541805 2.552187 -0.445551
C  0.068598 2.569697 -0.161834
C  4.560916 2.03624 -1.458877
C  0.167414 -0.302674 1.325597
C  2.566776 -2.312315 -0.811689
C  -0.891295 2.134593 -1.064923
C  -2.261797 2.147424 -0.791224
C  -0.355198 3.085401 1.056327
C  0.449503 -1.597066 2.071324
C  -0.071975 -2.869302 1.527602
C  -2.627246 2.641623 0.461929
C  -1.697988 3.114584 1.375734
C  -3.245135 1.662274 -1.808169
C  -1.100949 -2.914629 0.585953
C  0.468457 -4.07077 1.98785
C  -1.032422 -5.333212 0.574385
C  -1.575078 -4.130567 0.124856
C  0.000615 -5.280798 1.510305
C  -1.567658 -6.643937 0.089441
H  4.208491 2.727561 -2.224895
H  4.858347 2.634305 -0.597852
H  5.444488 1.527389 -1.840912
H  0.737799 0.50165 1.793034
H  -0.894382 -0.054586 1.398575
H  2.895962 -2.703926 0.150064
H  1.555652 -2.65483 -1.01285
H  3.223744 -2.686926 -1.591881
H  0.372071 3.445644 1.772176
H  -2.019447 3.503557 2.331825
H  -3.014172 0.64369 -2.12131
H  -4.262864 1.665362 -1.429826
H  -3.225342 2.287687 -2.70175
H  -1.560917 -2.009643 0.211626
H  1.271794 -4.062327 2.713258
H  -2.379657 -4.144407 -0.600566
H  0.44471 -6.201625 1.86882
H  -0.823318 -7.436026 0.165059
H  -2.430076 -6.951456 0.685878
H  -1.899454 -6.584632 -0.946952
elementType: Cl O N C H
totalener: -2106.09229326 hartree
nucrepener: 3134.18371182 hartree
electener: -5240.27600508 hartree
oneelecener: -9118.25059498 hartree
twoeener: 3877.97458990 hartree
cpcmener: -0.03622666 hartree
kineticenergy: 2099.71164597 hartree
xcener: -156.994573522310 hartree
chargesum: 0.0000000
charge: -0.071177 -0.081063 -0.355601 -0.437026 -0.406614 0.139085 -0.327778 -0.238584 0.294320 0.070282 0.366797 0.067764 -0.260449 0.077852 -0.184405 -0.006668 -0.046176 -0.136712 0.311492 -0.067293 0.115704 -0.186154 -0.230837 -0.161037 -0.124043 0.014073 -0.166291 -0.171557 -0.199897 0.102353 0.102414 0.096455 0.123973 0.132612 0.127439 0.124845 0.127301 0.148223 0.140029 0.105026 0.085861 0.113855 0.143745 0.139033 0.142542 0.143464 0.096816 0.107458 0.098549
qa: -0.0712 -0.0811 -0.3556 -0.4370 -0.4066 0.1391 -0.3278 -0.2386 0.2943 0.0703 0.3668 0.0678 -0.2604 0.0779 -0.1844 -0.0067 -0.0462 -0.1367 0.3115 -0.0673 0.1157 -0.1862 -0.2308 -0.1610 -0.1240 0.0141 -0.1663 -0.1716 -0.1999 0.1024 0.1024 0.0965 0.1240 0.1326 0.1274 0.1248 0.1273 0.1482 0.1400 0.1050 0.0859 0.1139 0.1437 0.1390 0.1425 0.1435 0.0968 0.1075 0.0985
va: 1.2739 1.2429 2.0076 2.0576 2.0786 3.3258 2.9306 3.4891 4.0557 4.0323 3.9098 3.4447 3.9593 3.6396 3.8998 3.8851 3.7350 3.9615 4.0083 3.5117 3.7914 4.0362 3.9282 3.9380 3.9540 3.7436 3.9520 3.9472 3.8978 0.9973 0.9987 1.0157 1.0191 0.9859 0.9847 0.9871 1.0083 1.0050 1.0086 1.0002 1.0231 0.9976 1.0041 1.0224 1.0003 1.0003 1.0030 0.9941 1.0012
dispcorr: -0.029986138 hartree
energy: -2106.122279400834
dipole: 8.90610 -10.93841 -2.03231 -30.69984 27.85754 -2.84230 0.53575 -0.74765 -0.21191
magnitude: 3.50055 au
magnitude: 8.89769 debye
