program: Orca
programVersion: 5.0.2
elementType: Cl Cl O O O N N C C C C C C C C C C C C C C C C C C C C C C H H H H H H H H H H H H H H H H H H H H
charge: 0
multiplicity: 1
keywords: wb97x-d3
keywords: def2-TZVPP
keywords: def2/J RIJCOSX
keywords: DEFGRID2
keywords: scfconv7
keywords: smallprint printgap noloewdin
keywords: NOSOSCF
formula: C22H20Cl2N2O3
InChI: InChI=1/C22H20Cl2N2O3/c1-12-5-7-15(8-6-12)18(27)11-29-22-19(14(3)25-26(22)4)21(28)16-9-10-17(23)13(2)20(16)24/h5-10H,11H2,1-4H3
49 atoms
Cl 0.813221 2.809213 -2.066151
Cl -4.40035 1.431053 -1.801902
O  1.240852 -0.451192 -1.229264
O  0.962914 2.714333 1.900633
O  1.960607 -2.429943 0.457972
N  3.428187 0.032517 -0.762284
N  4.214637 0.828094 -0.015545
C  2.048128 1.263001 0.423674
C  2.135429 0.245892 -0.529819
C  3.410762 1.558881 0.715906
C  0.907712 2.012365 0.905472
C  -0.396569 1.922322 0.171286
C  3.958725 2.559766 1.667676
C  0.225009 -1.164536 -0.548596
C  4.002675 -0.903324 -1.698827
C  -0.549402 2.19504 -1.186385
C  -1.771383 2.051415 -1.848479
C  -1.517086 1.561694 0.910665
C  0.767726 -2.240106 0.368126
C  -0.21098 -3.026882 1.150819
C  -2.850007 1.639952 -1.061837
C  -2.745063 1.407223 0.298313
C  -1.960203 2.324491 -3.307611
C  -1.585736 -2.801724 1.0777
C  0.259199 -4.027979 2.004386
C  -1.996602 -4.552832 2.694951
C  -2.461566 -3.556474 1.840642
C  -0.619778 -4.776134 2.761766
C  -2.942454 -5.380715 3.506984
H  3.585216 3.563042 1.460439
H  3.691151 2.323053 2.697809
H  5.045371 2.581815 1.597483
H  -0.420877 -0.496555 0.022847
H  -0.392545 -1.617897 -1.326496
H  3.694452 -0.674944 -2.717756
H  5.082491 -0.814254 -1.633245
H  3.717243 -1.924674 -1.459252
H  -1.420097 1.3656 1.970648
H  -3.609334 1.105266 0.873826
H  -2.638257 3.165207 -3.462695
H  -1.028114 2.557302 -3.812381
H  -2.395636 1.460407 -3.809979
H  -1.99781 -2.036413 0.432102
H  1.3218 -4.219889 2.078275
H  -3.52511 -3.362511 1.773307
H  -0.233861 -5.545606 3.419963
H  -2.56553 -5.540335 4.517729
H  -3.925161 -4.916526 3.580274
H  -3.077659 -6.367179 3.057699
elementType: Cl O N C H
totalener: -2106.09384085 hartree
nucrepener: 3130.09458555 hartree
electener: -5236.18842640 hartree
oneelecener: -9111.02664300 hartree
twoeener: 3874.83821661 hartree
cpcmener: -0.03599165 hartree
kineticenergy: 2099.71013122 hartree
xcener: -157.001638853826 hartree
chargesum: 0.0000000
charge: -0.070635 -0.075103 -0.346608 -0.439301 -0.425995 0.154484 -0.337774 -0.199126 0.209672 0.083622 0.375266 0.054145 -0.259588 0.092570 -0.166198 -0.027208 0.000424 -0.101458 0.359226 -0.047262 0.101637 -0.220388 -0.235347 -0.160125 -0.129269 0.019440 -0.177841 -0.176635 -0.201646 0.101695 0.101264 0.095335 0.068231 0.155250 0.121607 0.111435 0.115062 0.147458 0.144481 0.115032 0.087857 0.105148 0.143727 0.143577 0.141795 0.144002 0.101570 0.095194 0.107301
qa: -0.0706 -0.0751 -0.3466 -0.4393 -0.4260 0.1545 -0.3378 -0.1991 0.2097 0.0836 0.3753 0.0541 -0.2596 0.0926 -0.1662 -0.0272 0.0004 -0.1015 0.3592 -0.0473 0.1016 -0.2204 -0.2353 -0.1601 -0.1293 0.0194 -0.1778 -0.1766 -0.2016 0.1017 0.1013 0.0953 0.0682 0.1552 0.1216 0.1114 0.1151 0.1475 0.1445 0.1150 0.0879 0.1051 0.1437 0.1436 0.1418 0.1440 0.1016 0.0952 0.1073
va: 1.2648 1.2543 2.0710 2.0532 2.0572 3.3049 2.9358 3.4325 4.0999 4.0021 3.9135 3.4528 3.9549 3.8268 3.8887 3.8761 3.6950 3.9182 3.8868 3.6492 3.8365 4.0126 3.9260 3.9698 3.9722 3.7455 3.9723 3.9527 3.8992 0.9979 0.9992 1.0162 1.0390 0.9940 0.9880 1.0114 1.0027 1.0105 1.0084 0.9965 1.0240 1.0007 0.9992 1.0241 1.0024 1.0012 0.9993 1.0041 0.9944
dispcorr: -0.028886160 hartree
energy: -2106.122727012402
dipole: 3.94362 -6.70081 -2.75718 -23.87658 21.42343 -2.45315 13.76918 -14.50745 -0.73827
magnitude: 3.76365 au
magnitude: 9.56643 debye
