program: Orca
programVersion: 5.0.2
elementType: Cl Cl O O O N N C C C C C C C C C C C C C C C C C C C C C C H H H H H H H H H H H H H H H H H H H H
charge: 0
multiplicity: 1
keywords: wb97x-d3
keywords: def2-TZVPP
keywords: def2/J RIJCOSX
keywords: DEFGRID2
keywords: scfconv7
keywords: smallprint printgap noloewdin
keywords: NOSOSCF
formula: C22H20Cl2N2O3
InChI: InChI=1/C22H20Cl2N2O3/c1-12-5-7-15(8-6-12)18(27)11-29-22-19(14(3)25-26(22)4)21(28)16-9-10-17(23)13(2)20(16)24/h5-10H,11H2,1-4H3
49 atoms
Cl -0.597831 0.446003 -2.972839
Cl -4.079377 0.554264 1.158778
O  1.992695 -0.327384 0.995833
O  1.234318 2.740714 -2.041006
O  0.910229 -2.291042 -1.399305
N  4.09908 0.629214 0.720992
N  4.718725 1.608251 0.039411
C  2.529362 1.583383 -0.485362
C  2.796839 0.570176 0.431738
C  3.799821 2.192719 -0.690797
C  1.278284 1.962991 -1.105052
C  -0.006684 1.441191 -0.538715
C  4.154859 3.337173 -1.568795
C  2.117609 -1.684487 0.539859
C  4.850305 -0.223932 1.609769
C  -0.978485 0.837372 -1.32966
C  -2.251997 0.509935 -0.854949
C  -0.310018 1.710105 0.789928
C  0.851068 -2.07962 -0.206777
C  -0.40658 -2.227249 0.553632
C  -2.512459 0.840517 0.47584
C  -1.559983 1.419712 1.299149
C  -3.264808 -0.129266 -1.750795
C  -1.545412 -2.689812 -0.109503
C  -0.502465 -1.935531 1.915369
C  -2.835757 -2.571854 1.930214
C  -2.734721 -2.864971 0.570376
C  -1.701526 -2.100572 2.586968
C  -4.11982 -2.774628 2.669978
H  3.995286 3.098806 -2.620458
H  3.555483 4.219366 -1.343474
H  5.204669 3.59504 -1.43499
H  2.969026 -1.80148 -0.132977
H  2.275432 -2.323599 1.410303
H  4.215529 -0.570036 2.421997
H  5.260326 -1.083676 1.080678
H  5.667383 0.355118 2.031295
H  0.425673 2.183924 1.426875
H  -1.795019 1.654565 2.328161
H  -3.624443 0.580382 -2.498509
H  -2.840468 -0.976224 -2.287482
H  -4.127811 -0.489761 -1.199355
H  -1.499484 -2.921358 -1.165443
H  0.347262 -1.56788 2.474846
H  -3.603784 -3.230046 0.03656
H  -1.755818 -1.856073 3.640989
H  -4.114532 -3.73363 3.193473
H  -4.276716 -2.001374 3.421582
H  -4.976631 -2.776366 1.99763
elementType: Cl O N C H
totalener: -2106.08965984 hartree
nucrepener: 3273.11449430 hartree
electener: -5379.20415414 hartree
oneelecener: -9397.97887808 hartree
twoeener: 4018.77472394 hartree
cpcmener: -0.04006085 hartree
kineticenergy: 2099.71325599 hartree
xcener: -156.998519112320 hartree
chargesum: 0.0000000
charge: -0.071516 -0.086495 -0.353359 -0.423502 -0.401356 0.125757 -0.326167 -0.194738 0.270134 0.080651 0.323762 0.018279 -0.255909 0.045206 -0.172209 0.044158 -0.035821 -0.168474 0.313368 -0.024732 0.154195 -0.180947 -0.263047 -0.112710 -0.183207 0.003616 -0.180684 -0.158250 -0.205844 0.100506 0.102648 0.096052 0.130181 0.135747 0.123410 0.126468 0.121735 0.153510 0.137362 0.133126 0.100722 0.090342 0.140853 0.138970 0.139479 0.138315 0.116938 0.096672 0.096805
qa: -0.0715 -0.0865 -0.3534 -0.4235 -0.4014 0.1258 -0.3262 -0.1947 0.2701 0.0807 0.3238 0.0183 -0.2559 0.0452 -0.1722 0.0442 -0.0358 -0.1685 0.3134 -0.0247 0.1542 -0.1809 -0.2630 -0.1127 -0.1832 0.0036 -0.1807 -0.1583 -0.2058 0.1005 0.1026 0.0961 0.1302 0.1357 0.1234 0.1265 0.1217 0.1535 0.1374 0.1331 0.1007 0.0903 0.1409 0.1390 0.1395 0.1383 0.1169 0.0967 0.0968
va: 1.2717 1.2348 2.0312 2.0663 2.0682 3.3183 2.9239 3.5118 4.1156 4.0028 3.9465 3.4718 3.9533 3.7304 3.8837 3.8929 3.6529 3.9429 3.9830 3.4445 3.7113 4.0001 3.9193 3.8771 3.9145 3.6727 3.8859 3.9006 3.8862 1.0002 0.9977 1.0157 1.0041 0.9879 0.9942 0.9840 1.0077 0.9928 1.0104 0.9970 1.0003 1.0194 1.0254 1.0141 1.0026 1.0008 0.9967 1.0030 1.0040
dispcorr: -0.035278576 hartree
energy: -2106.124938416536
dipole: 7.72303 -7.95836 -0.23533 -10.39386 8.31740 -2.07646 14.35791 -10.74352 3.61439
magnitude: 4.17503 au
magnitude: 10.61208 debye
