program: Orca
programVersion: 5.0.2
elementType: Cl Cl O O O N N C C C C C C C C C C C C C C C C C C C C C C H H H H H H H H H H H H H H H H H H H H
charge: 0
multiplicity: 1
keywords: wb97x-d3
keywords: def2-TZVPP
keywords: def2/J RIJCOSX
keywords: DEFGRID2
keywords: scfconv7
keywords: smallprint printgap noloewdin
keywords: NOSOSCF
formula: C22H20Cl2N2O3
InChI: InChI=1/C22H20Cl2N2O3/c1-12-5-7-15(8-6-12)18(27)11-29-22-19(14(3)25-26(22)4)21(28)16-9-10-17(23)13(2)20(16)24/h5-10H,11H2,1-4H3
49 atoms
Cl 0.531318 2.634254 -2.354728
Cl -4.213917 0.168515 -1.52077
O  1.761522 -0.438005 -1.294957
O  0.956507 3.077016 1.422911
O  1.854551 -1.589614 1.191779
N  3.807188 0.234232 -0.590646
N  4.459995 1.180061 0.108302
C  2.235261 1.521305 0.240421
C  2.485021 0.387955 -0.54288
C  3.539269 1.954674 0.622728
C  1.002471 2.170739 0.607801
C  -0.288267 1.69314 0.018607
C  3.925336 3.120845 1.458751
C  0.678973 -1.223853 -0.834221
C  4.528236 -0.821212 -1.259396
C  -0.614782 1.839305 -1.32514
C  -1.826053 1.388345 -1.854894
C  -1.212474 1.121581 0.88185
C  0.817781 -1.730901 0.581827
C  -0.370199 -2.380576 1.177885
C  -2.701499 0.784286 -0.947454
C  -2.420119 0.654038 0.401248
C  -2.197499 1.515774 -3.298184
C  -1.478526 -2.751376 0.414412
C  -0.401322 -2.596278 2.555661
C  -2.634489 -3.509667 2.397958
C  -2.588371 -3.31385 1.018232
C  -1.52095 -3.14443 3.154249
C  -3.842923 -4.113029 3.041941
H  3.538519 4.055245 1.051586
H  3.547652 3.031629 2.477297
H  5.011195 3.195478 1.505086
H  -0.264041 -0.692039 -0.95571
H  0.638682 -2.083984 -1.508757
H  4.210527 -1.797543 -0.896322
H  4.38729 -0.776075 -2.338227
H  5.583221 -0.691842 -1.038857
H  -0.974647 1.016688 1.932493
H  -3.130878 0.18764 1.069378
H  -3.10141 2.114662 -3.41716
H  -1.415095 1.981399 -3.889174
H  -2.398825 0.536296 -3.733775
H  -1.492952 -2.611226 -0.658909
H  0.445218 -2.312229 3.167444
H  -3.43854 -3.595666 0.408802
H  -1.535238 -3.283447 4.228528
H  -3.910833 -3.850221 4.097002
H  -4.760608 -3.789024 2.550913
H  -3.81331 -5.203139 2.978791
elementType: Cl O N C H
totalener: -2106.09105783 hartree
nucrepener: 3209.42987885 hartree
electener: -5315.52093668 hartree
oneelecener: -9269.80657800 hartree
twoeener: 3954.28564132 hartree
cpcmener: -0.03717959 hartree
kineticenergy: 2099.71770727 hartree
xcener: -157.006830888243 hartree
chargesum: -0.0000000
charge: -0.068562 -0.076354 -0.349865 -0.444458 -0.412793 0.146049 -0.339789 -0.218987 0.248601 0.072763 0.364205 0.072055 -0.259569 0.085359 -0.164789 0.020338 -0.026195 -0.133286 0.342835 -0.037838 0.125322 -0.227013 -0.243594 -0.171409 -0.135416 0.023756 -0.174605 -0.165028 -0.201080 0.100236 0.099950 0.095231 0.076397 0.159757 0.115546 0.119679 0.112673 0.147382 0.139287 0.114340 0.087797 0.108075 0.142448 0.142829 0.140652 0.143915 0.096227 0.099564 0.107364
qa: -0.0686 -0.0764 -0.3499 -0.4445 -0.4128 0.1460 -0.3398 -0.2190 0.2486 0.0728 0.3642 0.0721 -0.2596 0.0854 -0.1648 0.0203 -0.0262 -0.1333 0.3428 -0.0378 0.1253 -0.2270 -0.2436 -0.1714 -0.1354 0.0238 -0.1746 -0.1650 -0.2011 0.1002 0.0999 0.0952 0.0764 0.1598 0.1155 0.1197 0.1127 0.1474 0.1393 0.1143 0.0878 0.1081 0.1424 0.1428 0.1407 0.1439 0.0962 0.0996 0.1074
va: 1.2712 1.2540 2.0846 2.0532 2.0540 3.2948 2.9350 3.4666 4.0730 4.0118 3.9074 3.4198 3.9580 3.8469 3.8930 3.8227 3.6955 3.9326 3.8481 3.5862 3.7632 3.9908 3.9343 3.9306 3.9680 3.7328 3.9314 3.9455 3.9004 0.9979 1.0002 1.0162 1.0071 0.9924 0.9971 0.9888 1.0111 1.0053 1.0124 0.9967 1.0231 0.9987 1.0023 1.0234 1.0036 1.0009 1.0036 1.0000 0.9944
dispcorr: -0.032023074 hartree
energy: -2106.123080902963
dipole: 2.47839 -4.91256 -2.43417 -18.60248 15.41172 -3.19077 12.32769 -13.44670 -1.11901
magnitude: 4.16634 au
magnitude: 10.58999 debye
