program: Orca
programVersion: 5.0.2
elementType: Cl Cl O O O N N C C C C C C C C C C C C C C C C C C C C C C H H H H H H H H H H H H H H H H H H H H
charge: 0
multiplicity: 1
keywords: wb97x-d3
keywords: def2-TZVPP
keywords: def2/J RIJCOSX
keywords: DEFGRID2
keywords: scfconv7
keywords: smallprint printgap noloewdin
keywords: NOSOSCF
formula: C22H20Cl2N2O3
InChI: InChI=1/C22H20Cl2N2O3/c1-12-5-7-15(8-6-12)18(27)11-29-22-19(14(3)25-26(22)4)21(28)16-9-10-17(23)13(2)20(16)24/h5-10H,11H2,1-4H3
49 atoms
Cl 0.247242 2.696029 -2.883683
Cl -3.828472 5.005665 -0.170678
O  2.487103 -1.609599 -0.854589
O  -0.375137 -0.468654 -1.500644
O  2.250531 -2.516713 1.66149
N  3.437749 0.12953 0.263632
N  3.215453 1.378112 0.707753
C  1.351611 0.56686 -0.273828
C  2.366377 -0.399961 -0.318452
C  1.975484 1.660705 0.404569
C  0.043372 0.489334 -0.87933
C  -0.883788 1.660718 -0.699263
C  1.438578 2.99976 0.776431
C  1.511818 -2.591602 -0.594172
C  4.711201 -0.510838 0.4781
C  -0.912719 2.717838 -1.597062
C  -1.805929 3.783889 -1.477691
C  -1.785424 1.647709 0.351953
C  1.48876 -3.00791 0.864256
C  0.490274 -4.031665 1.260073
C  -2.685857 3.726076 -0.396152
C  -2.686558 2.683196 0.513097
C  -1.849081 4.93625 -2.432156
C  -0.390151 -4.61196 0.347923
C  0.42431 -4.425124 2.594968
C  -1.377606 -5.955565 2.095473
C  -1.307786 -5.5599 0.762405
C  -0.497482 -5.37062 3.003152
C  -2.363204 -6.997123 2.53101
H  1.21649 3.606169 -0.101539
H  0.524991 2.930884 1.365004
H  2.187436 3.526073 1.365554
H  0.524534 -2.255439 -0.917814
H  1.786897 -3.449707 -1.212188
H  5.196594 -0.7473 -0.467442
H  5.331676 0.185817 1.032198
H  4.583023 -1.4238 1.054743
H  -1.777902 0.826477 1.056754
H  -3.388663 2.681571 1.33468
H  -2.82733 5.00719 -2.908274
H  -1.678709 5.878188 -1.909945
H  -1.102059 4.847056 -3.214079
H  -0.380244 -4.326687 -0.696057
H  1.09855 -3.97771 3.312961
H  -1.985977 -5.995316 0.038634
H  -0.538621 -5.658118 4.04666
H  -2.011363 -7.997225 2.270726
H  -2.522222 -6.977373 3.608115
H  -3.330007 -6.859306 2.047159
totalener: -2106.06955375 hartree
nucrepener: 3003.73669196 hartree
electener: -5109.80624571 hartree
oneelecener: -8858.67067990 hartree
twoeener: 3748.86443419 hartree
kineticenergy: 2099.77992368 hartree
xcener: -157.008737152328 hartree
chargesum: -0.0000000
charge: -0.062533 -0.070390 -0.309496 -0.379590 -0.357266 0.128610 -0.291184 -0.233708 0.243971 0.109184 0.333635 0.130299 -0.282794 -0.048547 -0.176934 -0.020144 -0.045243 -0.158820 0.347351 -0.078423 0.065518 -0.138622 -0.232611 -0.129561 -0.110970 0.027034 -0.154667 -0.133393 -0.203146 0.101335 0.100859 0.110841 0.144046 0.128783 0.108747 0.112254 0.118502 0.120334 0.121611 0.105240 0.102696 0.086985 0.119835 0.137854 0.115792 0.114779 0.103343 0.085107 0.093498
qa: -0.0625 -0.0704 -0.3095 -0.3796 -0.3573 0.1286 -0.2912 -0.2337 0.2440 0.1092 0.3336 0.1303 -0.2828 -0.0485 -0.1769 -0.0201 -0.0452 -0.1588 0.3474 -0.0784 0.0655 -0.1386 -0.2326 -0.1296 -0.1110 0.0270 -0.1547 -0.1334 -0.2031 0.1013 0.1009 0.1108 0.1440 0.1288 0.1087 0.1123 0.1185 0.1203 0.1216 0.1052 0.1027 0.0870 0.1198 0.1379 0.1158 0.1148 0.1033 0.0851 0.0935
va: 1.2731 1.2593 2.1302 2.1039 2.1143 3.3271 2.9287 3.5146 4.1233 3.9232 3.9085 3.5428 3.9879 3.8618 3.8935 3.9253 3.7308 4.0036 3.7964 3.7190 3.9229 4.0170 3.9312 3.9914 4.0230 3.7862 4.0274 3.9651 3.9105 0.9921 0.9882 1.0209 1.0136 0.9992 0.9889 1.0128 1.0032 1.0105 1.0140 0.9999 1.0005 1.0282 1.0115 1.0260 1.0093 1.0092 0.9935 1.0073 1.0010
dispcorr: -0.026683261 hartree
energy: -2106.096237006857
dipole: 5.61004 -6.08651 -0.47648 -29.36722 27.93399 -1.43323 14.76531 -14.31049 0.45482
magnitude: 1.57735 au
magnitude: 4.00930 debye
