program: Orca
programVersion: 5.0.2
elementType: Cl Cl O O O N N C C C C C C C C C C C C C C C C C C C C C C H H H H H H H H H H H H H H H H H H H H
charge: 0
multiplicity: 1
keywords: wb97x-d3
keywords: def2-TZVPP
keywords: def2/J RIJCOSX
keywords: DEFGRID2
keywords: scfconv7
keywords: smallprint printgap noloewdin
keywords: NOSOSCF
formula: C22H20Cl2N2O3
InChI: InChI=1/C22H20Cl2N2O3/c1-12-5-7-15(8-6-12)18(27)11-29-22-19(14(3)25-26(22)4)21(28)16-9-10-17(23)13(2)20(16)24/h5-10H,11H2,1-4H3
49 atoms
Cl -0.925494 1.676672 -3.091539
Cl -3.694695 4.006212 0.925288
O  3.302732 -1.482487 -0.009814
O  0.355188 -0.709406 -1.435441
O  1.409148 -1.375636 1.872743
N  4.129756 0.605656 0.157393
N  3.842027 1.912957 0.012796
C  2.026411 0.659109 -0.47384
C  3.090372 -0.179511 -0.132152
C  2.587189 1.967035 -0.345896
C  0.675667 0.319203 -0.875669
C  -0.389745 1.301197 -0.487209
C  1.958507 3.287734 -0.631591
C  2.257519 -2.41874 -0.0764
C  5.426182 0.187059 0.62266
C  -1.224801 1.918016 -1.405806
C  -2.262883 2.776053 -1.032361
C  -0.595313 1.540776 0.864934
C  1.225964 -2.21245 1.021764
C  0.026847 -3.081562 1.010464
C  -2.436218 2.971216 0.337543
C  -1.619927 2.366287 1.281346
C  -3.116826 3.431833 -2.072727
C  -0.222494 -4.00761 -0.000945
C  -0.889258 -2.970708 2.053841
C  -2.274654 -4.690235 1.073621
C  -1.354595 -4.800204 0.034429
C  -2.020442 -3.76431 2.082437
C  -3.51728 -5.528205 1.083212
H  1.481058 3.302734 -1.611528
H  1.198681 3.548982 0.105012
H  2.725814 4.059398 -0.614458
H  1.783924 -2.408013 -1.058219
H  2.732726 -3.393211 0.062556
H  5.348636 -0.354351 1.564659
H  5.924487 -0.447756 -0.108708
H  6.016955 1.084404 0.774934
H  0.053156 1.069266 1.592333
H  -1.786662 2.545949 2.333894
H  -3.597686 2.685863 -2.705571
H  -3.893419 4.048672 -1.632155
H  -2.515053 4.064764 -2.725555
H  0.454863 -4.115909 -0.837283
H  -0.707833 -2.255672 2.844687
H  -1.531059 -5.511162 -0.763342
H  -2.721616 -3.661773 2.901209
H  -4.244719 -5.147878 0.363836
H  -3.3058 -6.562225 0.810993
H  -3.995544 -5.530448 2.061095
totalener: -2106.06721758 hartree
nucrepener: 3096.71625557 hartree
electener: -5202.78347315 hartree
oneelecener: -9044.93377317 hartree
twoeener: 3842.15030002 hartree
kineticenergy: 2099.78529065 hartree
xcener: -157.011379926229 hartree
chargesum: -0.0000000
charge: -0.057367 -0.074015 -0.302327 -0.354954 -0.349121 0.092077 -0.289130 -0.166146 0.324363 0.089264 0.211544 0.060953 -0.284372 -0.052505 -0.178425 0.018235 -0.048107 -0.167289 0.299033 -0.023749 0.111662 -0.148308 -0.229876 -0.127803 -0.118338 0.016569 -0.145890 -0.124300 -0.205853 0.095632 0.100464 0.109382 0.141767 0.132803 0.113185 0.106620 0.115194 0.146475 0.120344 0.104907 0.085484 0.101484 0.111352 0.131303 0.113080 0.113359 0.105365 0.092525 0.083453
qa: -0.0574 -0.0740 -0.3023 -0.3550 -0.3491 0.0921 -0.2891 -0.1661 0.3244 0.0893 0.2115 0.0610 -0.2844 -0.0525 -0.1784 0.0182 -0.0481 -0.1673 0.2990 -0.0237 0.1117 -0.1483 -0.2299 -0.1278 -0.1183 0.0166 -0.1459 -0.1243 -0.2059 0.0956 0.1005 0.1094 0.1418 0.1328 0.1132 0.1066 0.1152 0.1465 0.1203 0.1049 0.0855 0.1015 0.1114 0.1313 0.1131 0.1134 0.1054 0.0925 0.0835
va: 1.2847 1.2504 2.1500 2.1012 2.1146 3.3075 2.9359 3.3997 4.0460 3.9275 3.9633 3.4732 3.9818 3.8925 3.9059 3.9315 3.7480 3.9463 3.7921 3.6562 3.8492 4.0679 3.9352 4.0151 4.0255 3.8045 4.0161 3.9621 3.9117 0.9986 0.9889 1.0205 1.0144 0.9900 0.9929 0.9906 1.0129 1.0072 1.0154 1.0001 1.0259 1.0016 1.0165 1.0289 1.0088 1.0089 0.9931 1.0003 1.0079
dispcorr: -0.028218258 hartree
energy: -2106.095435838821
dipole: 5.90701 -6.06511 -0.15809 -21.16440 19.72292 -1.44148 6.70032 -6.47329 0.22703
magnitude: 1.46779 au
magnitude: 3.73082 debye
