program: Orca
programVersion: 5.0.2
elementType: Cl Cl O O O N N C C C C C C C C C C C C C C C C C C C C C C H H H H H H H H H H H H H H H H H H H H
charge: 0
multiplicity: 1
keywords: wb97x-d3
keywords: def2-TZVPP
keywords: def2/J RIJCOSX
keywords: DEFGRID2
keywords: scfconv7
keywords: smallprint printgap noloewdin
keywords: NOSOSCF
formula: C22H20Cl2N2O3
InChI: InChI=1/C22H20Cl2N2O3/c1-12-5-7-15(8-6-12)18(27)11-29-22-19(14(3)25-26(22)4)21(28)16-9-10-17(23)13(2)20(16)24/h5-10H,11H2,1-4H3
49 atoms
Cl 0.276362 1.277565 -2.898948
Cl -4.381709 0.586715 -0.222842
O  1.312889 -0.360736 0.294707
O  1.345971 3.907048 -0.617687
O  1.62693 -3.625427 -0.171226
N  3.607112 0.102168 0.265538
N  4.458915 1.120378 0.053032
C  2.339477 1.825711 -0.225831
C  2.333059 0.476058 0.097129
C  3.721326 2.164595 -0.233511
C  1.218724 2.715371 -0.450099
C  -0.169718 2.133044 -0.407119
C  4.345369 3.48284 -0.516956
C  1.098252 -1.380693 -0.685114
C  4.113035 -1.194396 0.644289
C  -0.724386 1.472687 -1.493886
C  -2.02922 0.975158 -1.493253
C  -0.946932 2.330716 0.722185
C  0.874448 -2.702673 0.036317
C  -0.276621 -2.816197 0.959436
C  -2.761841 1.188647 -0.324277
C  -2.243696 1.85545 0.771723
C  -2.639232 0.246664 -2.650277
C  -1.235495 -1.813607 1.091876
C  -0.427968 -3.989808 1.699437
C  -2.47044 -3.151252 2.679978
C  -2.319875 -1.986491 1.934764
C  -1.50491 -4.149304 2.547539
C  -3.624514 -3.32352 3.620188
H  4.035633 4.231344 0.211486
H  5.429168 3.39112 -0.486523
H  4.050742 3.858956 -1.495772
H  0.227156 -1.116407 -1.292122
H  1.953343 -1.485279 -1.355499
H  3.472591 -1.647732 1.397353
H  4.18382 -1.868949 -0.208663
H  5.104214 -1.04874 1.062025
H  -0.534022 2.857589 1.571984
H  -2.851267 2.003318 1.653393
H  -1.970896 0.199102 -3.5038
H  -2.900729 -0.774361 -2.368199
H  -3.559375 0.733628 -2.972672
H  -1.156556 -0.884641 0.544098
H  0.305272 -4.778919 1.599932
H  -3.063602 -1.202307 2.005927
H  -1.605604 -5.066909 3.11451
H  -3.347458 -3.01784 4.631245
H  -4.481116 -2.720824 3.321658
H  -3.947129 -4.362752 3.674521
totalener: -2106.06195981 hartree
nucrepener: 3180.71076750 hartree
electener: -5286.77272732 hartree
oneelecener: -9211.31344687 hartree
twoeener: 3924.54071956 hartree
kineticenergy: 2099.77714123 hartree
xcener: -156.999839506962 hartree
chargesum: -0.0000000
charge: -0.067531 -0.066049 -0.332202 -0.327357 -0.320800 0.115728 -0.285431 -0.285937 0.305606 0.066193 0.315861 0.132921 -0.240625 0.014172 -0.176773 -0.062702 -0.001451 -0.094550 0.215227 -0.052404 0.020513 -0.145000 -0.241517 0.024634 -0.085602 0.014970 -0.152231 -0.144546 -0.206035 0.096001 0.096564 0.097590 0.100430 0.141580 0.115719 0.112297 0.123007 0.119689 0.119347 0.092492 0.105031 0.114874 0.003058 0.132104 0.095659 0.114918 0.103339 0.089038 0.090183
qa: -0.0675 -0.0660 -0.3322 -0.3274 -0.3208 0.1157 -0.2854 -0.2859 0.3056 0.0662 0.3159 0.1329 -0.2406 0.0142 -0.1768 -0.0627 -0.0015 -0.0946 0.2152 -0.0524 0.0205 -0.1450 -0.2415 0.0246 -0.0856 0.0150 -0.1522 -0.1445 -0.2060 0.0960 0.0966 0.0976 0.1004 0.1416 0.1157 0.1123 0.1230 0.1197 0.1193 0.0925 0.1050 0.1149 0.0031 0.1321 0.0957 0.1149 0.1033 0.0890 0.0902
va: 1.2685 1.2666 2.0246 2.1663 2.1454 3.2926 2.9179 3.5998 4.0084 4.0375 3.9359 3.5608 3.9585 3.7320 3.8934 3.8991 3.6264 4.0247 4.0231 3.6750 3.8657 3.9524 3.9244 3.8766 3.9754 3.8504 4.0209 3.9696 3.9084 1.0026 1.0144 1.0011 1.0059 0.9990 0.9952 0.9926 1.0125 1.0086 1.0161 1.0260 0.9974 1.0016 1.0737 1.0260 1.0268 1.0082 0.9932 1.0055 1.0036
dispcorr: -0.031886539 hartree
energy: -2106.093846353944
dipole: 5.17742 -6.32118 -1.14376 -14.46433 13.26352 -1.20081 14.71292 -13.85864 0.85427
magnitude: 1.86546 au
magnitude: 4.74161 debye
