program: Orca
programVersion: 5.0.2
elementType: Cl Cl O O O N N C C C C C C C C C C C C C C C C C C C C C C H H H H H H H H H H H H H H H H H H H H
charge: 0
multiplicity: 1
keywords: wb97x-d3
keywords: def2-TZVPP
keywords: def2/J RIJCOSX
keywords: DEFGRID2
keywords: scfconv7
keywords: smallprint printgap noloewdin
keywords: NOSOSCF
formula: C22H20Cl2N2O3
InChI: InChI=1/C22H20Cl2N2O3/c1-12-5-7-15(8-6-12)18(27)11-29-22-19(14(3)25-26(22)4)21(28)16-9-10-17(23)13(2)20(16)24/h5-10H,11H2,1-4H3
49 atoms
Cl 0.713222 2.746168 -2.129177
Cl -4.434373 1.197158 -1.616401
O  1.344747 -0.404211 -1.234537
O  0.993183 2.860889 1.814399
O  2.002893 -2.48449 0.389008
N  3.515843 0.066036 -0.661508
N  4.274838 0.874467 0.09643
C  2.092214 1.343313 0.416436
C  2.214359 0.298711 -0.500074
C  3.444126 1.634784 0.762586
C  0.941945 2.100842 0.870509
C  -0.382051 1.921094 0.181415
C  3.951991 2.658971 1.712488
C  0.32045 -1.118411 -0.588135
C  4.129762 -0.911921 -1.524321
C  -0.595178 2.136205 -1.176853
C  -1.837342 1.922783 -1.782594
C  -1.460996 1.552618 0.976391
C  0.825419 -2.23886 0.304188
C  -0.193378 -2.997629 1.071839
C  -2.8690 1.495976 -0.945247
C  -2.702565 1.321959 0.418387
C  -2.092258 2.149098 -3.24062
C  -1.56131 -2.758585 0.953116
C  0.236882 -3.994909 1.946568
C  -2.04532 -4.4924 2.56463
C  -2.471049 -3.500489 1.687091
C  -0.675689 -4.726582 2.679978
C  -3.027371 -5.271348 3.385769
H  5.040207 2.649884 1.709586
H  3.609231 3.657952 1.444509
H  3.600883 2.468937 2.725554
H  -0.325464 -0.460055 -0.003409
H  -0.298886 -1.537433 -1.384834
H  5.203374 -0.816343 -1.399673
H  3.819056 -1.916381 -1.249937
H  3.875117 -0.727413 -2.566881
H  -1.314312 1.427116 2.040924
H  -3.538075 1.019816 1.034021
H  -2.787221 2.977294 -3.385592
H  -1.18254 2.378096 -3.785212
H  -2.544491 1.268844 -3.696472
H  -1.941414 -1.993489 0.287765
H  1.295919 -4.190767 2.046775
H  -3.530019 -3.303151 1.575254
H  -0.321291 -5.49643 3.354607
H  -2.701551 -6.300978 3.529877
H  -3.140914 -4.826557 4.376442
H  -4.013484 -5.293199 2.924064
totalener: -2106.06465799 hartree
nucrepener: 3135.33866773 hartree
electener: -5241.40332572 hartree
oneelecener: -9121.16551540 hartree
twoeener: 3879.76218968 hartree
kineticenergy: 2099.78369729 hartree
xcener: -157.008743059765 hartree
chargesum: -0.0000000
charge: -0.053262 -0.065019 -0.323932 -0.342304 -0.353011 0.146925 -0.294253 -0.202317 0.216878 0.074450 0.313212 0.056237 -0.240033 0.079427 -0.179203 -0.018068 -0.032135 -0.076167 0.303421 -0.034384 0.106567 -0.230613 -0.229900 -0.150251 -0.109705 0.023193 -0.150658 -0.131875 -0.203020 0.094971 0.093573 0.096640 0.025723 0.130009 0.113130 0.119272 0.106832 0.127712 0.125738 0.110629 0.089345 0.095793 0.117221 0.138568 0.113778 0.117416 0.091698 0.104895 0.086855
qa: -0.0533 -0.0650 -0.3239 -0.3423 -0.3530 0.1469 -0.2943 -0.2023 0.2169 0.0744 0.3132 0.0562 -0.2400 0.0794 -0.1792 -0.0181 -0.0321 -0.0762 0.3034 -0.0344 0.1066 -0.2306 -0.2299 -0.1503 -0.1097 0.0232 -0.1507 -0.1319 -0.2030 0.0950 0.0936 0.0966 0.0257 0.1300 0.1131 0.1193 0.1068 0.1277 0.1257 0.1106 0.0893 0.0958 0.1172 0.1386 0.1138 0.1174 0.0917 0.1049 0.0869
va: 1.2822 1.2654 2.0841 2.1510 2.1188 3.3170 2.9311 3.4649 4.0546 4.0357 3.9656 3.4936 3.9518 3.8685 3.8920 3.8811 3.7089 3.9044 3.9024 3.6882 3.8436 3.9940 3.9329 4.0049 4.0246 3.7900 4.0389 3.9624 3.9090 1.0152 1.0016 1.0024 1.0452 0.9968 1.0136 1.0024 0.9895 1.0183 1.0160 0.9979 1.0281 1.0040 1.0061 1.0250 1.0100 1.0079 1.0032 0.9935 1.0055
dispcorr: -0.029043533 hartree
energy: -2106.093701526023
dipole: 3.96760 -5.71695 -1.74935 -22.95994 21.12785 -1.83209 13.77535 -14.11763 -0.34228
magnitude: 2.55616 au
magnitude: 6.49723 debye
