program: Orca
programVersion: 5.0.2
elementType: Cl Cl O O O N N C C C C C C C C C C C C C C C C C C C C C C H H H H H H H H H H H H H H H H H H H H
charge: 0
multiplicity: 1
keywords: wb97x-d3
keywords: def2-TZVPP
keywords: def2/J RIJCOSX
keywords: DEFGRID2
keywords: scfconv7
keywords: smallprint printgap noloewdin
keywords: NOSOSCF
formula: C22H20Cl2N2O3
InChI: InChI=1/C22H20Cl2N2O3/c1-12-5-7-15(8-6-12)18(27)11-29-22-19(14(3)25-26(22)4)21(28)16-9-10-17(23)13(2)20(16)24/h5-10H,11H2,1-4H3
49 atoms
Cl -1.002814 1.046533 -1.660023
Cl -3.1465 5.927026 -0.74746
O  2.285143 -1.097138 1.230858
O  -0.002456 0.7731 2.020943
O  2.460723 -3.579703 0.343092
N  3.471104 0.16738 -0.274534
N  3.446576 1.34566 -0.921304
C  1.577883 1.114783 0.317636
C  2.391457 -0.006543 0.488119
C  2.314789 1.919857 -0.600295
C  0.348504 1.385711 1.031959
C  -0.519678 2.508694 0.542684
C  1.990019 3.256033 -1.172617
C  1.084932 -1.831729 1.194519
C  4.601523 -0.714407 -0.423728
C  -1.19123 2.456397 -0.668949
C  -2.026914 3.478184 -1.127344
C  -0.715932 3.614382 1.357903
C  1.370846 -3.2553 0.742891
C  0.238838 -4.214404 0.807811
C  -2.157151 4.583292 -0.287165
C  -1.519421 4.656553 0.942493
C  -2.725681 3.356476 -2.446192
C  -1.045551 -3.836039 1.197663
C  0.467203 -5.546021 0.466961
C  -1.842491 -6.098514 0.911384
C  -2.068157 -4.766241 1.24611
C  -0.557896 -6.471103 0.522558
C  -2.960625 -7.09565 0.947445
H  2.865155 3.645884 -1.688482
H  1.17502 3.197701 -1.894233
H  1.69478 3.972546 -0.407351
H  0.633626 -1.823803 2.18827
H  0.355923 -1.391262 0.506302
H  5.43476 -0.382049 0.194492
H  4.319381 -1.723155 -0.137109
H  4.909881 -0.706309 -1.465668
H  -0.22485 3.660939 2.320734
H  -1.659954 5.524864 1.570346
H  -3.3406 4.224162 -2.662247
H  -2.006978 3.24379 -3.258384
H  -3.368739 2.47628 -2.464374
H  -1.269831 -2.812235 1.469236
H  1.45922 -5.85238 0.163333
H  -3.058013 -4.451318 1.553275
H  -0.358074 -7.503331 0.262067
H  -3.608468 -6.939976 1.809805
H  -3.584356 -7.011297 0.05537
H  -2.587745 -8.117988 0.988762
totalener: -2106.06863133 hartree
nucrepener: 2992.74494311 hartree
electener: -5098.81357444 hartree
oneelecener: -8836.26370259 hartree
twoeener: 3737.45012815 hartree
kineticenergy: 2099.77613809 hartree
xcener: -157.006171062430 hartree
chargesum: 0.0000000
charge: -0.065180 -0.068828 -0.293070 -0.354568 -0.344817 0.099354 -0.280468 -0.245354 0.260412 0.112715 0.292015 0.136625 -0.273225 0.014470 -0.171191 -0.124570 -0.024014 -0.132263 0.305755 -0.049940 0.101484 -0.146043 -0.215978 -0.143275 -0.108073 0.021460 -0.153505 -0.131837 -0.201175 0.111788 0.095484 0.099357 0.127467 0.095632 0.108670 0.126600 0.111319 0.121863 0.121308 0.086656 0.101526 0.103817 0.125926 0.135042 0.115919 0.114051 0.092488 0.103357 0.084814
qa: -0.0652 -0.0688 -0.2931 -0.3546 -0.3448 0.0994 -0.2805 -0.2454 0.2604 0.1127 0.2920 0.1366 -0.2732 0.0145 -0.1712 -0.1246 -0.0240 -0.1323 0.3058 -0.0499 0.1015 -0.1460 -0.2160 -0.1433 -0.1081 0.0215 -0.1535 -0.1318 -0.2012 0.1118 0.0955 0.0994 0.1275 0.0956 0.1087 0.1266 0.1113 0.1219 0.1213 0.0867 0.1015 0.1038 0.1259 0.1350 0.1159 0.1141 0.0925 0.1034 0.0848
va: 1.2763 1.2566 2.1343 2.1273 2.1297 3.3413 2.9105 3.3882 4.1402 3.9405 3.9468 3.4157 3.9755 3.8660 3.8873 3.9358 3.7253 4.0106 3.9238 3.7015 3.8740 4.0277 3.9279 3.9995 4.0291 3.7894 4.0314 3.9664 3.9096 1.0211 0.9950 0.9914 0.9996 0.9926 0.9912 1.0137 1.0029 1.0145 1.0143 1.0263 1.0005 1.0008 1.0109 1.0273 1.0091 1.0089 1.0016 0.9936 1.0071
dispcorr: -0.026521115 hartree
energy: -2106.095152442237
dipole: 4.04101 -5.01991 -0.97890 -28.84559 28.11133 -0.73425 1.44701 -1.58405 -0.13703
magnitude: 1.23132 au
magnitude: 3.12977 debye
