program: Orca
programVersion: 5.0.2
elementType: Cl Cl O O O N N C C C C C C C C C C C C C C C C C C C C C C H H H H H H H H H H H H H H H H H H H H
charge: 0
multiplicity: 1
keywords: wb97x-d3
keywords: def2-TZVPP
keywords: def2/J RIJCOSX
keywords: DEFGRID2
keywords: scfconv7
keywords: smallprint printgap noloewdin
keywords: NOSOSCF
formula: C22H20Cl2N2O3
InChI: InChI=1/C22H20Cl2N2O3/c1-12-5-7-15(8-6-12)18(27)11-29-22-19(14(3)25-26(22)4)21(28)16-9-10-17(23)13(2)20(16)24/h5-10H,11H2,1-4H3
49 atoms
Cl -1.013027 1.087667 -1.703024
Cl -3.109945 5.986548 -0.778119
O  2.236162 -1.09256 1.272547
O  -0.079442 0.766142 1.984934
O  2.459141 -3.575025 0.401077
N  3.446814 0.155472 -0.225871
N  3.436341 1.329087 -0.881142
C  1.543765 1.109452 0.322913
C  2.352847 -0.011575 0.517602
C  2.300247 1.907912 -0.585056
C  0.300719 1.385042 1.010641
C  -0.542887 2.525303 0.517503
C  1.992819 3.242187 -1.171147
C  1.046178 -1.842222 1.221468
C  4.581118 -0.726063 -0.344318
C  -1.198644 2.491696 -0.703199
C  -2.01452 3.52814 -1.164368
C  -0.734514 3.627317 1.338689
C  1.359924 -3.265846 0.787463
C  0.246737 -4.246247 0.852484
C  -2.14235 4.627481 -0.316473
C  -1.519436 4.682983 0.921651
C  -2.696827 3.426698 -2.493488
C  -1.046858 -3.892208 1.232738
C  0.505064 -5.575347 0.521864
C  -1.795122 -6.172465 0.956337
C  -2.050419 -4.843624 1.281585
C  -0.500447 -6.520842 0.577443
C  -2.890495 -7.194538 0.987035
H  1.182257 3.186839 -1.898312
H  1.700413 3.968431 -0.413365
H  2.876332 3.617603 -1.683884
H  0.579128 -1.831797 2.208039
H  0.322166 -1.417102 0.518511
H  4.912383 -0.723883 -1.379166
H  5.400024 -0.388377 0.290007
H  4.293981 -1.733175 -0.057471
H  -0.255113 3.660309 2.307947
H  -1.65683 5.548054 1.554641
H  -3.353094 2.556774 -2.526301
H  -3.295141 4.305437 -2.711707
H  -1.968893 3.308169 -3.296528
H  -1.293475 -2.871509 1.49658
H  1.505042 -5.862865 0.226233
H  -3.048177 -4.54777 1.58174
H  -0.277713 -7.550378 0.324894
H  -3.449187 -7.191081 0.048934
H  -2.498041 -8.200824 1.127112
H  -3.602359 -6.997192 1.787891
totalener: -2106.06878640 hartree
nucrepener: 2987.92877712 hartree
electener: -5093.99756352 hartree
oneelecener: -8826.65801397 hartree
twoeener: 3732.66045046 hartree
kineticenergy: 2099.77655400 hartree
xcener: -157.006262155616 hartree
chargesum: 0.0000000
charge: -0.064784 -0.069083 -0.293192 -0.356225 -0.346564 0.099515 -0.280286 -0.246145 0.257724 0.112354 0.298825 0.132969 -0.273199 0.014251 -0.171854 -0.123078 -0.024311 -0.130857 0.308518 -0.050044 0.102439 -0.147595 -0.216695 -0.144197 -0.108704 0.022594 -0.151621 -0.132968 -0.200872 0.095747 0.099323 0.111835 0.125773 0.097036 0.111242 0.108492 0.127398 0.121709 0.121244 0.104032 0.086690 0.101208 0.126071 0.135430 0.115120 0.114366 0.103453 0.086590 0.090329
qa: -0.0648 -0.0691 -0.2932 -0.3562 -0.3466 0.0995 -0.2803 -0.2461 0.2577 0.1124 0.2988 0.1330 -0.2732 0.0143 -0.1719 -0.1231 -0.0243 -0.1309 0.3085 -0.0500 0.1024 -0.1476 -0.2167 -0.1442 -0.1087 0.0226 -0.1516 -0.1330 -0.2009 0.0957 0.0993 0.1118 0.1258 0.0970 0.1112 0.1085 0.1274 0.1217 0.1212 0.1040 0.0867 0.1012 0.1261 0.1354 0.1151 0.1144 0.1035 0.0866 0.0903
va: 1.2768 1.2563 2.1327 2.1270 2.1276 3.3420 2.9108 3.3951 4.1433 3.9405 3.9404 3.4256 3.9750 3.8677 3.8869 3.9390 3.7258 4.0115 3.9192 3.7042 3.8732 4.0296 3.9289 4.0022 4.0291 3.7868 4.0301 3.9685 3.9093 0.9952 0.9913 1.0213 0.9998 0.9928 1.0030 0.9912 1.0137 1.0143 1.0144 1.0007 1.0263 1.0006 1.0107 1.0274 1.0095 1.0087 0.9933 1.0060 1.0031
dispcorr: -0.026447781 hartree
energy: -2106.095234179571
dipole: 4.30871 -5.25507 -0.94636 -29.35293 28.57875 -0.77418 1.79734 -1.92137 -0.12403
magnitude: 1.22896 au
magnitude: 3.12377 debye
