program: Orca
programVersion: 5.0.2
elementType: Cl Cl O O O N N C C C C C C C C C C C C C C C C C C C C C C H H H H H H H H H H H H H H H H H H H H
charge: 0
multiplicity: 1
keywords: wb97x-d3
keywords: def2-TZVPP
keywords: def2/J RIJCOSX
keywords: DEFGRID2
keywords: scfconv7
keywords: smallprint printgap noloewdin
keywords: NOSOSCF
formula: C22H20Cl2N2O3
InChI: InChI=1/C22H20Cl2N2O3/c1-12-5-7-15(8-6-12)18(27)11-29-22-19(14(3)25-26(22)4)21(28)16-9-10-17(23)13(2)20(16)24/h5-10H,11H2,1-4H3
49 atoms
Cl 0.688093 2.708395 -2.19725
Cl -4.431593 1.090345 -1.595228
O  1.375088 -0.373575 -1.192112
O  0.987452 2.999885 1.736969
O  2.009916 -2.444095 0.453522
N  3.537635 0.101385 -0.586437
N  4.284385 0.92502 0.167064
C  2.098327 1.41368 0.4268
C  2.233854 0.342212 -0.45717
C  3.444323 1.707973 0.793642
C  0.943468 2.188027 0.836854
C  -0.378405 1.961498 0.159074
C  3.940267 2.753943 1.725889
C  0.342107 -1.081684 -0.552437
C  4.168562 -0.905761 -1.402052
C  -0.599348 2.129377 -1.200874
C  -1.838849 1.887721 -1.804702
C  -1.454182 1.601031 0.963469
C  0.833123 -2.207516 0.339978
C  -0.198199 -2.981075 1.075519
C  -2.863855 1.461957 -0.960832
C  -2.68838 1.331577 0.409462
C  -2.020176 2.102309 -3.275141
C  -1.564035 -2.750631 0.928458
C  0.220283 -3.983411 1.951514
C  -2.071577 -4.503284 2.51216
C  -2.484951 -3.50625 1.635964
C  -0.702245 -4.727975 2.656976
C  -3.060184 -5.313037 3.295082
H  3.551915 2.605225 2.732201
H  5.027627 2.723753 1.759748
H  3.627144 3.74969 1.413189
H  -0.301177 -0.421373 0.033248
H  -0.277375 -1.491968 -1.353367
H  3.950945 -1.901824 -1.025587
H  3.835205 -0.831267 -2.435442
H  5.237673 -0.725303 -1.359957
H  -1.309521 1.509669 2.031758
H  -3.517334 1.030111 1.034165
H  -1.317805 1.49654 -3.847758
H  -3.024526 1.854088 -3.602636
H  -1.830351 3.143521 -3.537215
H  -1.935019 -1.981179 0.262925
H  1.2784 -4.170992 2.07446
H  -3.542468 -3.314292 1.503817
H  -0.357567 -5.500539 3.333711
H  -4.082704 -5.129471 2.969358
H  -2.864883 -6.381115 3.195673
H  -3.004782 -5.073665 4.358443
totalener: -2106.06502686 hartree
nucrepener: 3134.55910401 hartree
electener: -5240.62413087 hartree
oneelecener: -9119.57925476 hartree
twoeener: 3878.95512388 hartree
kineticenergy: 2099.78407337 hartree
xcener: -157.008831927761 hartree
chargesum: -0.0000000
charge: -0.049459 -0.068770 -0.324776 -0.342433 -0.354855 0.146081 -0.293613 -0.202310 0.219398 0.072243 0.317209 0.066950 -0.238946 0.077255 -0.182250 -0.058084 -0.041763 -0.078341 0.306395 -0.033508 0.142809 -0.230834 -0.229183 -0.147286 -0.106224 0.024116 -0.150740 -0.140666 -0.203733 0.096099 0.095035 0.093581 0.029833 0.128620 0.122178 0.106348 0.114136 0.127493 0.124147 0.102632 0.086013 0.107791 0.116063 0.138251 0.113401 0.119137 0.082837 0.097807 0.103914
qa: -0.0495 -0.0688 -0.3248 -0.3424 -0.3549 0.1461 -0.2936 -0.2023 0.2194 0.0722 0.3172 0.0669 -0.2389 0.0773 -0.1823 -0.0581 -0.0418 -0.0783 0.3064 -0.0335 0.1428 -0.2308 -0.2292 -0.1473 -0.1062 0.0241 -0.1507 -0.1407 -0.2037 0.0961 0.0950 0.0936 0.0298 0.1286 0.1222 0.1063 0.1141 0.1275 0.1241 0.1026 0.0860 0.1078 0.1161 0.1383 0.1134 0.1191 0.0828 0.0978 0.1039
va: 1.2944 1.2560 2.0816 2.1522 2.1180 3.3160 2.9295 3.4747 4.0562 4.0368 3.9591 3.4824 3.9521 3.8715 3.8941 3.9280 3.7334 3.9095 3.9021 3.6891 3.7852 4.0023 3.9427 4.0063 4.0166 3.7915 4.0388 3.9640 3.9090 1.0025 1.0152 1.0017 1.0415 0.9963 0.9991 0.9908 1.0134 1.0173 1.0166 1.0012 1.0245 1.0005 1.0077 1.0254 1.0107 1.0073 1.0088 0.9989 0.9949
dispcorr: -0.029069553 hartree
energy: -2106.094096413025
dipole: 4.27273 -5.95675 -1.68402 -22.73536 20.85183 -1.88353 13.82682 -14.16236 -0.33554
magnitude: 2.54876 au
magnitude: 6.47843 debye
